{"text_format":"3","workbook":"xlsx","n_sheets":4,"sheets":["1. Observations","2. Metadata","2.b Metadata Definitions"," 3. Changelog"],"read":"whole","date_system":"1900"}

{"sheet":"1. Observations","index":0,"n_rows":263,"n_cols":12,"rows_kept":263}
["date_time","site_id","latitude","longitude","notes",{"$f":"IF(ISBLANK('2. Metadata'!B13)=TRUE,\" \",'2. Metadata'!B13)","v":"maxiumum_water_temperature"},{"$f":"IF(ISBLANK('2. Metadata'!B13)=TRUE,\" \",'2. Metadata'!B13&\"_units\")","v":"maxiumum_water_temperature_units"},{"$f":"IF(ISBLANK('2. Metadata'!B25)=TRUE,\" \",'2. Metadata'!B25)","v":"minimum_water_temperature"},{"$f":"IF(ISBLANK('2. Metadata'!B25)=TRUE,\" \",'2. Metadata'!B25&\"_units\")","v":"minimum_water_temperature_units"},{"$f":"IF(ISBLANK('2. Metadata'!B37)=TRUE,\" \",'2. Metadata'!B37)","v":"average_water_temperature"},{"$f":"IF(ISBLANK('2. Metadata'!B37)=TRUE,\" \",'2. Metadata'!B37&\"_units\")","v":"average_water_temperature_units"},"water_hub_qa_qc"]
["2013-08-04","NECAR01",{"$f":"IF(ISBLANK(B2)=TRUE,\" \", IF(B2='2. Metadata'!B$1,'2. Metadata'!B$5, IF(B2='2. Metadata'!C$1,'2. Metadata'!C$5,IF(B2='2. Metadata'!D$1,'2. Metadata'!D$5, IF(B2='2. Metadata'!E$1,'2. Metadata'!E$5,IF( B2='2. Metadata'!F$1,'2. Metadata'!F$5,IF(B2='2. Metadata'!G$1,'2. Metadata'!G$5,IF(B2='2. Metadata'!H$1,'2. Metadata'!H$5, IF(B2='2. Metadata'!I$1,'2. Metadata'!I$5, IF(B2='2. Metadata'!J$1,'2. Metadata'!J$5, IF(B2='2. Metadata'!K$1,'2. Metadata'!K$5, IF(B2='2. Metadata'!L$1,'2. Metadata'!L$5, IF(B2='2. Metadata'!M$1,'2. Metadata'!M$5, IF(B2='2. Metadata'!N$1,'2. Metadata'!N$5))))))))))))))","v":49.97944},{"$f":"IF(ISBLANK(B2)=TRUE,\" \", IF(B2='2. Metadata'!B$1,'2. Metadata'!B$6, IF(B2='2. Metadata'!C$1,'2. Metadata'!C$6,IF(B2='2. Metadata'!D$1,'2. Metadata'!D$6, IF(B2='2. Metadata'!E$1,'2. Metadata'!E$6,IF( B2='2. Metadata'!F$1,'2. Metadata'!F$6,IF(B2='2. Metadata'!G$1,'2. Metadata'!G$6,IF(B2='2. Metadata'!H$1,'2. Metadata'!H$6, IF(B2='2. Metadata'!I$1,'2. Metadata'!I$6, IF(B2='2. Metadata'!J$1,'2. Metadata'!J$6, IF(B2='2. Metadata'!K$1,'2. Metadata'!K$6, IF(B2='2. Metadata'!L$1,'2. Metadata'!L$6, IF(B2='2. Metadata'!M$1,'2. Metadata'!M$6, IF(B2='2. Metadata'!N$1,'2. Metadata'!N$6))))))))))))))","v":-117.88417},"n/a",15.055,{"$f":"IF(ISBLANK(F2)=TRUE,\" \",'2. Metadata'!B$14)","v":"degrees Celsius"},12.799,{"$f":"IF(ISBLANK(H2)=TRUE,\" \",'2. Metadata'!B$26)","v":"degrees Celsius"},13.785,{"$f":"IF(ISBLANK(J2)=TRUE,\" \",'2. Metadata'!B$38)","v":"degrees Celsius"},"n/a"]
["2013-08-05","NECAR01",{"$f":"IF(ISBLANK(B3)=TRUE,\" \", IF(B3='2. Metadata'!B$1,'2. Metadata'!B$5, IF(B3='2. Metadata'!C$1,'2. Metadata'!C$5,IF(B3='2. Metadata'!D$1,'2. Metadata'!D$5, IF(B3='2. Metadata'!E$1,'2. Metadata'!E$5,IF( B3='2. Metadata'!F$1,'2. Metadata'!F$5,IF(B3='2. Metadata'!G$1,'2. Metadata'!G$5,IF(B3='2. Metadata'!H$1,'2. Metadata'!H$5, IF(B3='2. Metadata'!I$1,'2. Metadata'!I$5, IF(B3='2. Metadata'!J$1,'2. Metadata'!J$5, IF(B3='2. Metadata'!K$1,'2. Metadata'!K$5, IF(B3='2. Metadata'!L$1,'2. Metadata'!L$5, IF(B3='2. Metadata'!M$1,'2. Metadata'!M$5, IF(B3='2. Metadata'!N$1,'2. Metadata'!N$5))))))))))))))","v":49.97944},{"$f":"IF(ISBLANK(B3)=TRUE,\" \", IF(B3='2. Metadata'!B$1,'2. Metadata'!B$6, IF(B3='2. Metadata'!C$1,'2. Metadata'!C$6,IF(B3='2. Metadata'!D$1,'2. Metadata'!D$6, IF(B3='2. Metadata'!E$1,'2. Metadata'!E$6,IF( B3='2. Metadata'!F$1,'2. Metadata'!F$6,IF(B3='2. Metadata'!G$1,'2. Metadata'!G$6,IF(B3='2. Metadata'!H$1,'2. Metadata'!H$6, IF(B3='2. Metadata'!I$1,'2. Metadata'!I$6, IF(B3='2. Metadata'!J$1,'2. Metadata'!J$6, IF(B3='2. Metadata'!K$1,'2. Metadata'!K$6, IF(B3='2. Metadata'!L$1,'2. Metadata'!L$6, IF(B3='2. Metadata'!M$1,'2. Metadata'!M$6, IF(B3='2. Metadata'!N$1,'2. Metadata'!N$6))))))))))))))","v":-117.88417},"n/a",15.342,{"$f":"IF(ISBLANK(F3)=TRUE,\" \",'2. Metadata'!B$14)","v":"degrees Celsius"},12.098,{"$f":"IF(ISBLANK(H3)=TRUE,\" \",'2. Metadata'!B$26)","v":"degrees Celsius"},13.531,{"$f":"IF(ISBLANK(J3)=TRUE,\" \",'2. Metadata'!B$38)","v":"degrees Celsius"},"n/a"]
["2013-08-06","NECAR01",{"$f":"IF(ISBLANK(B4)=TRUE,\" \", IF(B4='2. Metadata'!B$1,'2. Metadata'!B$5, IF(B4='2. Metadata'!C$1,'2. Metadata'!C$5,IF(B4='2. Metadata'!D$1,'2. Metadata'!D$5, IF(B4='2. Metadata'!E$1,'2. Metadata'!E$5,IF( B4='2. Metadata'!F$1,'2. Metadata'!F$5,IF(B4='2. Metadata'!G$1,'2. Metadata'!G$5,IF(B4='2. Metadata'!H$1,'2. Metadata'!H$5, IF(B4='2. Metadata'!I$1,'2. Metadata'!I$5, IF(B4='2. Metadata'!J$1,'2. Metadata'!J$5, IF(B4='2. Metadata'!K$1,'2. Metadata'!K$5, IF(B4='2. Metadata'!L$1,'2. Metadata'!L$5, IF(B4='2. Metadata'!M$1,'2. Metadata'!M$5, IF(B4='2. Metadata'!N$1,'2. Metadata'!N$5))))))))))))))","v":49.97944},{"$f":"IF(ISBLANK(B4)=TRUE,\" \", IF(B4='2. Metadata'!B$1,'2. Metadata'!B$6, IF(B4='2. Metadata'!C$1,'2. Metadata'!C$6,IF(B4='2. Metadata'!D$1,'2. Metadata'!D$6, IF(B4='2. Metadata'!E$1,'2. Metadata'!E$6,IF( B4='2. Metadata'!F$1,'2. Metadata'!F$6,IF(B4='2. Metadata'!G$1,'2. Metadata'!G$6,IF(B4='2. Metadata'!H$1,'2. Metadata'!H$6, IF(B4='2. Metadata'!I$1,'2. Metadata'!I$6, IF(B4='2. Metadata'!J$1,'2. Metadata'!J$6, IF(B4='2. Metadata'!K$1,'2. Metadata'!K$6, IF(B4='2. Metadata'!L$1,'2. Metadata'!L$6, IF(B4='2. Metadata'!M$1,'2. Metadata'!M$6, IF(B4='2. Metadata'!N$1,'2. Metadata'!N$6))))))))))))))","v":-117.88417},"n/a",15.772,{"$f":"IF(ISBLANK(F4)=TRUE,\" \",'2. Metadata'!B$14)","v":"degrees Celsius"},12.074,{"$f":"IF(ISBLANK(H4)=TRUE,\" \",'2. Metadata'!B$26)","v":"degrees Celsius"},13.845,{"$f":"IF(ISBLANK(J4)=TRUE,\" \",'2. Metadata'!B$38)","v":"degrees Celsius"},"n/a"]
["2013-08-07","NECAR01",{"$f":"IF(ISBLANK(B5)=TRUE,\" \", IF(B5='2. Metadata'!B$1,'2. Metadata'!B$5, IF(B5='2. Metadata'!C$1,'2. Metadata'!C$5,IF(B5='2. Metadata'!D$1,'2. Metadata'!D$5, IF(B5='2. Metadata'!E$1,'2. Metadata'!E$5,IF( B5='2. Metadata'!F$1,'2. Metadata'!F$5,IF(B5='2. Metadata'!G$1,'2. Metadata'!G$5,IF(B5='2. Metadata'!H$1,'2. Metadata'!H$5, IF(B5='2. Metadata'!I$1,'2. Metadata'!I$5, IF(B5='2. Metadata'!J$1,'2. Metadata'!J$5, IF(B5='2. Metadata'!K$1,'2. Metadata'!K$5, IF(B5='2. Metadata'!L$1,'2. Metadata'!L$5, IF(B5='2. Metadata'!M$1,'2. Metadata'!M$5, IF(B5='2. Metadata'!N$1,'2. Metadata'!N$5))))))))))))))","v":49.97944},{"$f":"IF(ISBLANK(B5)=TRUE,\" \", IF(B5='2. Metadata'!B$1,'2. Metadata'!B$6, IF(B5='2. Metadata'!C$1,'2. Metadata'!C$6,IF(B5='2. Metadata'!D$1,'2. Metadata'!D$6, IF(B5='2. Metadata'!E$1,'2. Metadata'!E$6,IF( B5='2. Metadata'!F$1,'2. Metadata'!F$6,IF(B5='2. Metadata'!G$1,'2. Metadata'!G$6,IF(B5='2. Metadata'!H$1,'2. Metadata'!H$6, IF(B5='2. Metadata'!I$1,'2. Metadata'!I$6, IF(B5='2. Metadata'!J$1,'2. Metadata'!J$6, IF(B5='2. Metadata'!K$1,'2. Metadata'!K$6, IF(B5='2. Metadata'!L$1,'2. Metadata'!L$6, IF(B5='2. Metadata'!M$1,'2. Metadata'!M$6, IF(B5='2. Metadata'!N$1,'2. Metadata'!N$6))))))))))))))","v":-117.88417},"n/a",16.63,{"$f":"IF(ISBLANK(F5)=TRUE,\" \",'2. Metadata'!B$14)","v":"degrees Celsius"},12.654,{"$f":"IF(ISBLANK(H5)=TRUE,\" \",'2. Metadata'!B$26)","v":"degrees Celsius"},14.3,{"$f":"IF(ISBLANK(J5)=TRUE,\" \",'2. Metadata'!B$38)","v":"degrees Celsius"},"n/a"]
["2013-08-08","NECAR01",{"$f":"IF(ISBLANK(B6)=TRUE,\" \", IF(B6='2. Metadata'!B$1,'2. Metadata'!B$5, IF(B6='2. Metadata'!C$1,'2. Metadata'!C$5,IF(B6='2. Metadata'!D$1,'2. Metadata'!D$5, IF(B6='2. Metadata'!E$1,'2. Metadata'!E$5,IF( B6='2. Metadata'!F$1,'2. Metadata'!F$5,IF(B6='2. Metadata'!G$1,'2. Metadata'!G$5,IF(B6='2. Metadata'!H$1,'2. Metadata'!H$5, IF(B6='2. Metadata'!I$1,'2. Metadata'!I$5, IF(B6='2. Metadata'!J$1,'2. Metadata'!J$5, IF(B6='2. Metadata'!K$1,'2. Metadata'!K$5, IF(B6='2. Metadata'!L$1,'2. Metadata'!L$5, IF(B6='2. Metadata'!M$1,'2. Metadata'!M$5, IF(B6='2. Metadata'!N$1,'2. Metadata'!N$5))))))))))))))","v":49.97944},{"$f":"IF(ISBLANK(B6)=TRUE,\" \", IF(B6='2. Metadata'!B$1,'2. Metadata'!B$6, IF(B6='2. Metadata'!C$1,'2. Metadata'!C$6,IF(B6='2. Metadata'!D$1,'2. Metadata'!D$6, IF(B6='2. Metadata'!E$1,'2. Metadata'!E$6,IF( B6='2. Metadata'!F$1,'2. Metadata'!F$6,IF(B6='2. Metadata'!G$1,'2. Metadata'!G$6,IF(B6='2. Metadata'!H$1,'2. Metadata'!H$6, IF(B6='2. Metadata'!I$1,'2. Metadata'!I$6, IF(B6='2. Metadata'!J$1,'2. Metadata'!J$6, IF(B6='2. Metadata'!K$1,'2. Metadata'!K$6, IF(B6='2. Metadata'!L$1,'2. Metadata'!L$6, IF(B6='2. Metadata'!M$1,'2. Metadata'!M$6, IF(B6='2. Metadata'!N$1,'2. Metadata'!N$6))))))))))))))","v":-117.88417},"n/a",16.153,{"$f":"IF(ISBLANK(F6)=TRUE,\" \",'2. Metadata'!B$14)","v":"degrees Celsius"},12.703,{"$f":"IF(ISBLANK(H6)=TRUE,\" \",'2. Metadata'!B$26)","v":"degrees Celsius"},14.243,{"$f":"IF(ISBLANK(J6)=TRUE,\" \",'2. Metadata'!B$38)","v":"degrees Celsius"},"n/a"]
["2013-08-09","NECAR01",{"$f":"IF(ISBLANK(B7)=TRUE,\" \", IF(B7='2. Metadata'!B$1,'2. Metadata'!B$5, IF(B7='2. Metadata'!C$1,'2. Metadata'!C$5,IF(B7='2. Metadata'!D$1,'2. Metadata'!D$5, IF(B7='2. Metadata'!E$1,'2. Metadata'!E$5,IF( B7='2. Metadata'!F$1,'2. Metadata'!F$5,IF(B7='2. Metadata'!G$1,'2. Metadata'!G$5,IF(B7='2. Metadata'!H$1,'2. Metadata'!H$5, IF(B7='2. Metadata'!I$1,'2. Metadata'!I$5, IF(B7='2. Metadata'!J$1,'2. Metadata'!J$5, IF(B7='2. Metadata'!K$1,'2. Metadata'!K$5, IF(B7='2. Metadata'!L$1,'2. Metadata'!L$5, IF(B7='2. Metadata'!M$1,'2. Metadata'!M$5, IF(B7='2. Metadata'!N$1,'2. Metadata'!N$5))))))))))))))","v":49.97944},{"$f":"IF(ISBLANK(B7)=TRUE,\" \", IF(B7='2. Metadata'!B$1,'2. Metadata'!B$6, IF(B7='2. Metadata'!C$1,'2. Metadata'!C$6,IF(B7='2. Metadata'!D$1,'2. Metadata'!D$6, IF(B7='2. Metadata'!E$1,'2. Metadata'!E$6,IF( B7='2. Metadata'!F$1,'2. Metadata'!F$6,IF(B7='2. Metadata'!G$1,'2. Metadata'!G$6,IF(B7='2. Metadata'!H$1,'2. Metadata'!H$6, IF(B7='2. Metadata'!I$1,'2. Metadata'!I$6, IF(B7='2. Metadata'!J$1,'2. Metadata'!J$6, IF(B7='2. Metadata'!K$1,'2. Metadata'!K$6, IF(B7='2. Metadata'!L$1,'2. Metadata'!L$6, IF(B7='2. Metadata'!M$1,'2. Metadata'!M$6, IF(B7='2. Metadata'!N$1,'2. Metadata'!N$6))))))))))))))","v":-117.88417},"n/a",16.463,{"$f":"IF(ISBLANK(F7)=TRUE,\" \",'2. Metadata'!B$14)","v":"degrees Celsius"},12.799,{"$f":"IF(ISBLANK(H7)=TRUE,\" \",'2. Metadata'!B$26)","v":"degrees Celsius"},14.323,{"$f":"IF(ISBLANK(J7)=TRUE,\" \",'2. Metadata'!B$38)","v":"degrees Celsius"},"n/a"]
["2013-08-10","NECAR01",{"$f":"IF(ISBLANK(B8)=TRUE,\" \", IF(B8='2. Metadata'!B$1,'2. Metadata'!B$5, IF(B8='2. Metadata'!C$1,'2. Metadata'!C$5,IF(B8='2. Metadata'!D$1,'2. Metadata'!D$5, IF(B8='2. Metadata'!E$1,'2. Metadata'!E$5,IF( B8='2. Metadata'!F$1,'2. Metadata'!F$5,IF(B8='2. Metadata'!G$1,'2. Metadata'!G$5,IF(B8='2. Metadata'!H$1,'2. Metadata'!H$5, IF(B8='2. Metadata'!I$1,'2. Metadata'!I$5, IF(B8='2. Metadata'!J$1,'2. Metadata'!J$5, IF(B8='2. Metadata'!K$1,'2. Metadata'!K$5, IF(B8='2. Metadata'!L$1,'2. Metadata'!L$5, IF(B8='2. Metadata'!M$1,'2. Metadata'!M$5, IF(B8='2. Metadata'!N$1,'2. Metadata'!N$5))))))))))))))","v":49.97944},{"$f":"IF(ISBLANK(B8)=TRUE,\" \", IF(B8='2. Metadata'!B$1,'2. Metadata'!B$6, IF(B8='2. Metadata'!C$1,'2. Metadata'!C$6,IF(B8='2. Metadata'!D$1,'2. Metadata'!D$6, IF(B8='2. Metadata'!E$1,'2. Metadata'!E$6,IF( B8='2. Metadata'!F$1,'2. Metadata'!F$6,IF(B8='2. Metadata'!G$1,'2. Metadata'!G$6,IF(B8='2. Metadata'!H$1,'2. Metadata'!H$6, IF(B8='2. Metadata'!I$1,'2. Metadata'!I$6, IF(B8='2. Metadata'!J$1,'2. Metadata'!J$6, IF(B8='2. Metadata'!K$1,'2. Metadata'!K$6, IF(B8='2. Metadata'!L$1,'2. Metadata'!L$6, IF(B8='2. Metadata'!M$1,'2. Metadata'!M$6, IF(B8='2. Metadata'!N$1,'2. Metadata'!N$6))))))))))))))","v":-117.88417},"n/a",16.511,{"$f":"IF(ISBLANK(F8)=TRUE,\" \",'2. Metadata'!B$14)","v":"degrees Celsius"},13.088,{"$f":"IF(ISBLANK(H8)=TRUE,\" \",'2. Metadata'!B$26)","v":"degrees Celsius"},14.57,{"$f":"IF(ISBLANK(J8)=TRUE,\" \",'2. Metadata'!B$38)","v":"degrees Celsius"},"n/a"]
["2013-08-11","NECAR01",{"$f":"IF(ISBLANK(B9)=TRUE,\" \", IF(B9='2. Metadata'!B$1,'2. Metadata'!B$5, IF(B9='2. Metadata'!C$1,'2. Metadata'!C$5,IF(B9='2. Metadata'!D$1,'2. Metadata'!D$5, IF(B9='2. Metadata'!E$1,'2. Metadata'!E$5,IF( B9='2. Metadata'!F$1,'2. Metadata'!F$5,IF(B9='2. Metadata'!G$1,'2. Metadata'!G$5,IF(B9='2. Metadata'!H$1,'2. Metadata'!H$5, IF(B9='2. Metadata'!I$1,'2. Metadata'!I$5, IF(B9='2. Metadata'!J$1,'2. Metadata'!J$5, IF(B9='2. Metadata'!K$1,'2. Metadata'!K$5, IF(B9='2. Metadata'!L$1,'2. Metadata'!L$5, IF(B9='2. Metadata'!M$1,'2. Metadata'!M$5, IF(B9='2. Metadata'!N$1,'2. Metadata'!N$5))))))))))))))","v":49.97944},{"$f":"IF(ISBLANK(B9)=TRUE,\" \", IF(B9='2. Metadata'!B$1,'2. Metadata'!B$6, IF(B9='2. Metadata'!C$1,'2. Metadata'!C$6,IF(B9='2. Metadata'!D$1,'2. Metadata'!D$6, IF(B9='2. Metadata'!E$1,'2. Metadata'!E$6,IF( B9='2. Metadata'!F$1,'2. Metadata'!F$6,IF(B9='2. Metadata'!G$1,'2. Metadata'!G$6,IF(B9='2. Metadata'!H$1,'2. Metadata'!H$6, IF(B9='2. Metadata'!I$1,'2. Metadata'!I$6, IF(B9='2. Metadata'!J$1,'2. Metadata'!J$6, IF(B9='2. Metadata'!K$1,'2. Metadata'!K$6, IF(B9='2. Metadata'!L$1,'2. Metadata'!L$6, IF(B9='2. Metadata'!M$1,'2. Metadata'!M$6, IF(B9='2. Metadata'!N$1,'2. Metadata'!N$6))))))))))))))","v":-117.88417},"n/a",16.392,{"$f":"IF(ISBLANK(F9)=TRUE,\" \",'2. Metadata'!B$14)","v":"degrees Celsius"},12.944,{"$f":"IF(ISBLANK(H9)=TRUE,\" \",'2. Metadata'!B$26)","v":"degrees Celsius"},14.307,{"$f":"IF(ISBLANK(J9)=TRUE,\" \",'2. Metadata'!B$38)","v":"degrees Celsius"},"n/a"]
["2013-08-12","NECAR01",{"$f":"IF(ISBLANK(B10)=TRUE,\" \", IF(B10='2. Metadata'!B$1,'2. Metadata'!B$5, IF(B10='2. Metadata'!C$1,'2. Metadata'!C$5,IF(B10='2. Metadata'!D$1,'2. Metadata'!D$5, IF(B10='2. Metadata'!E$1,'2. Metadata'!E$5,IF( B10='2. Metadata'!F$1,'2. Metadata'!F$5,IF(B10='2. Metadata'!G$1,'2. Metadata'!G$5,IF(B10='2. Metadata'!H$1,'2. Metadata'!H$5, IF(B10='2. Metadata'!I$1,'2. Metadata'!I$5, IF(B10='2. Metadata'!J$1,'2. Metadata'!J$5, IF(B10='2. Metadata'!K$1,'2. Metadata'!K$5, IF(B10='2. Metadata'!L$1,'2. Metadata'!L$5, IF(B10='2. Metadata'!M$1,'2. Metadata'!M$5, IF(B10='2. Metadata'!N$1,'2. Metadata'!N$5))))))))))))))","v":49.97944},{"$f":"IF(ISBLANK(B10)=TRUE,\" \", IF(B10='2. Metadata'!B$1,'2. Metadata'!B$6, IF(B10='2. Metadata'!C$1,'2. Metadata'!C$6,IF(B10='2. Metadata'!D$1,'2. Metadata'!D$6, IF(B10='2. Metadata'!E$1,'2. Metadata'!E$6,IF( B10='2. Metadata'!F$1,'2. Metadata'!F$6,IF(B10='2. Metadata'!G$1,'2. Metadata'!G$6,IF(B10='2. Metadata'!H$1,'2. Metadata'!H$6, IF(B10='2. Metadata'!I$1,'2. Metadata'!I$6, IF(B10='2. Metadata'!J$1,'2. Metadata'!J$6, IF(B10='2. Metadata'!K$1,'2. Metadata'!K$6, IF(B10='2. Metadata'!L$1,'2. Metadata'!L$6, IF(B10='2. Metadata'!M$1,'2. Metadata'!M$6, IF(B10='2. Metadata'!N$1,'2. Metadata'!N$6))))))))))))))","v":-117.88417},"n/a",15.581,{"$f":"IF(ISBLANK(F10)=TRUE,\" \",'2. Metadata'!B$14)","v":"degrees Celsius"},13.329,{"$f":"IF(ISBLANK(H10)=TRUE,\" \",'2. Metadata'!B$26)","v":"degrees Celsius"},14.334,{"$f":"IF(ISBLANK(J10)=TRUE,\" \",'2. Metadata'!B$38)","v":"degrees Celsius"},"n/a"]
["2013-08-13","NECAR01",{"$f":"IF(ISBLANK(B11)=TRUE,\" \", IF(B11='2. Metadata'!B$1,'2. Metadata'!B$5, IF(B11='2. Metadata'!C$1,'2. Metadata'!C$5,IF(B11='2. Metadata'!D$1,'2. Metadata'!D$5, IF(B11='2. Metadata'!E$1,'2. Metadata'!E$5,IF( B11='2. Metadata'!F$1,'2. Metadata'!F$5,IF(B11='2. Metadata'!G$1,'2. Metadata'!G$5,IF(B11='2. Metadata'!H$1,'2. Metadata'!H$5, IF(B11='2. Metadata'!I$1,'2. Metadata'!I$5, IF(B11='2. Metadata'!J$1,'2. Metadata'!J$5, IF(B11='2. Metadata'!K$1,'2. Metadata'!K$5, IF(B11='2. Metadata'!L$1,'2. Metadata'!L$5, IF(B11='2. Metadata'!M$1,'2. Metadata'!M$5, IF(B11='2. Metadata'!N$1,'2. Metadata'!N$5))))))))))))))","v":49.97944},{"$f":"IF(ISBLANK(B11)=TRUE,\" \", IF(B11='2. Metadata'!B$1,'2. Metadata'!B$6, IF(B11='2. Metadata'!C$1,'2. Metadata'!C$6,IF(B11='2. Metadata'!D$1,'2. Metadata'!D$6, IF(B11='2. Metadata'!E$1,'2. Metadata'!E$6,IF( B11='2. Metadata'!F$1,'2. Metadata'!F$6,IF(B11='2. Metadata'!G$1,'2. Metadata'!G$6,IF(B11='2. Metadata'!H$1,'2. Metadata'!H$6, IF(B11='2. Metadata'!I$1,'2. Metadata'!I$6, IF(B11='2. Metadata'!J$1,'2. Metadata'!J$6, IF(B11='2. Metadata'!K$1,'2. Metadata'!K$6, IF(B11='2. Metadata'!L$1,'2. Metadata'!L$6, IF(B11='2. Metadata'!M$1,'2. Metadata'!M$6, IF(B11='2. Metadata'!N$1,'2. Metadata'!N$6))))))))))))))","v":-117.88417},"n/a",16.534,{"$f":"IF(ISBLANK(F11)=TRUE,\" \",'2. Metadata'!B$14)","v":"degrees Celsius"},12.63,{"$f":"IF(ISBLANK(H11)=TRUE,\" \",'2. Metadata'!B$26)","v":"degrees Celsius"},14.291,{"$f":"IF(ISBLANK(J11)=TRUE,\" \",'2. Metadata'!B$38)","v":"degrees Celsius"},"n/a"]
["2013-08-14","NECAR01",{"$f":"IF(ISBLANK(B12)=TRUE,\" \", IF(B12='2. Metadata'!B$1,'2. Metadata'!B$5, IF(B12='2. Metadata'!C$1,'2. Metadata'!C$5,IF(B12='2. Metadata'!D$1,'2. Metadata'!D$5, IF(B12='2. Metadata'!E$1,'2. Metadata'!E$5,IF( B12='2. Metadata'!F$1,'2. Metadata'!F$5,IF(B12='2. Metadata'!G$1,'2. Metadata'!G$5,IF(B12='2. Metadata'!H$1,'2. Metadata'!H$5, IF(B12='2. Metadata'!I$1,'2. Metadata'!I$5, IF(B12='2. Metadata'!J$1,'2. Metadata'!J$5, IF(B12='2. Metadata'!K$1,'2. Metadata'!K$5, IF(B12='2. Metadata'!L$1,'2. Metadata'!L$5, IF(B12='2. Metadata'!M$1,'2. Metadata'!M$5, IF(B12='2. Metadata'!N$1,'2. Metadata'!N$5))))))))))))))","v":49.97944},{"$f":"IF(ISBLANK(B12)=TRUE,\" \", IF(B12='2. Metadata'!B$1,'2. Metadata'!B$6, IF(B12='2. Metadata'!C$1,'2. Metadata'!C$6,IF(B12='2. Metadata'!D$1,'2. Metadata'!D$6, IF(B12='2. Metadata'!E$1,'2. Metadata'!E$6,IF( B12='2. Metadata'!F$1,'2. Metadata'!F$6,IF(B12='2. Metadata'!G$1,'2. Metadata'!G$6,IF(B12='2. Metadata'!H$1,'2. Metadata'!H$6, IF(B12='2. Metadata'!I$1,'2. Metadata'!I$6, IF(B12='2. Metadata'!J$1,'2. Metadata'!J$6, IF(B12='2. Metadata'!K$1,'2. Metadata'!K$6, IF(B12='2. Metadata'!L$1,'2. Metadata'!L$6, IF(B12='2. Metadata'!M$1,'2. Metadata'!M$6, IF(B12='2. Metadata'!N$1,'2. Metadata'!N$6))))))))))))))","v":-117.88417},"n/a",16.296,{"$f":"IF(ISBLANK(F12)=TRUE,\" \",'2. Metadata'!B$14)","v":"degrees Celsius"},12.896,{"$f":"IF(ISBLANK(H12)=TRUE,\" \",'2. Metadata'!B$26)","v":"degrees Celsius"},14.469,{"$f":"IF(ISBLANK(J12)=TRUE,\" \",'2. Metadata'!B$38)","v":"degrees Celsius"},"n/a"]
["2013-08-15","NECAR01",{"$f":"IF(ISBLANK(B13)=TRUE,\" \", IF(B13='2. Metadata'!B$1,'2. Metadata'!B$5, IF(B13='2. Metadata'!C$1,'2. Metadata'!C$5,IF(B13='2. Metadata'!D$1,'2. Metadata'!D$5, IF(B13='2. Metadata'!E$1,'2. Metadata'!E$5,IF( B13='2. Metadata'!F$1,'2. Metadata'!F$5,IF(B13='2. Metadata'!G$1,'2. Metadata'!G$5,IF(B13='2. Metadata'!H$1,'2. Metadata'!H$5, IF(B13='2. Metadata'!I$1,'2. Metadata'!I$5, IF(B13='2. Metadata'!J$1,'2. Metadata'!J$5, IF(B13='2. Metadata'!K$1,'2. Metadata'!K$5, IF(B13='2. Metadata'!L$1,'2. Metadata'!L$5, IF(B13='2. Metadata'!M$1,'2. Metadata'!M$5, IF(B13='2. Metadata'!N$1,'2. Metadata'!N$5))))))))))))))","v":49.97944},{"$f":"IF(ISBLANK(B13)=TRUE,\" \", IF(B13='2. Metadata'!B$1,'2. Metadata'!B$6, IF(B13='2. Metadata'!C$1,'2. Metadata'!C$6,IF(B13='2. Metadata'!D$1,'2. Metadata'!D$6, IF(B13='2. Metadata'!E$1,'2. Metadata'!E$6,IF( B13='2. Metadata'!F$1,'2. Metadata'!F$6,IF(B13='2. Metadata'!G$1,'2. Metadata'!G$6,IF(B13='2. Metadata'!H$1,'2. Metadata'!H$6, IF(B13='2. Metadata'!I$1,'2. Metadata'!I$6, IF(B13='2. Metadata'!J$1,'2. Metadata'!J$6, IF(B13='2. Metadata'!K$1,'2. Metadata'!K$6, IF(B13='2. Metadata'!L$1,'2. Metadata'!L$6, IF(B13='2. Metadata'!M$1,'2. Metadata'!M$6, IF(B13='2. Metadata'!N$1,'2. Metadata'!N$6))))))))))))))","v":-117.88417},"n/a",16.344,{"$f":"IF(ISBLANK(F13)=TRUE,\" \",'2. Metadata'!B$14)","v":"degrees Celsius"},13.497,{"$f":"IF(ISBLANK(H13)=TRUE,\" \",'2. Metadata'!B$26)","v":"degrees Celsius"},14.847,{"$f":"IF(ISBLANK(J13)=TRUE,\" \",'2. Metadata'!B$38)","v":"degrees Celsius"},"n/a"]
["2013-08-16","NECAR01",{"$f":"IF(ISBLANK(B14)=TRUE,\" \", IF(B14='2. Metadata'!B$1,'2. Metadata'!B$5, IF(B14='2. Metadata'!C$1,'2. Metadata'!C$5,IF(B14='2. Metadata'!D$1,'2. Metadata'!D$5, IF(B14='2. Metadata'!E$1,'2. Metadata'!E$5,IF( B14='2. Metadata'!F$1,'2. Metadata'!F$5,IF(B14='2. Metadata'!G$1,'2. Metadata'!G$5,IF(B14='2. Metadata'!H$1,'2. Metadata'!H$5, IF(B14='2. Metadata'!I$1,'2. Metadata'!I$5, IF(B14='2. Metadata'!J$1,'2. Metadata'!J$5, IF(B14='2. Metadata'!K$1,'2. Metadata'!K$5, IF(B14='2. Metadata'!L$1,'2. Metadata'!L$5, IF(B14='2. Metadata'!M$1,'2. Metadata'!M$5, IF(B14='2. Metadata'!N$1,'2. Metadata'!N$5))))))))))))))","v":49.97944},{"$f":"IF(ISBLANK(B14)=TRUE,\" \", IF(B14='2. Metadata'!B$1,'2. Metadata'!B$6, IF(B14='2. Metadata'!C$1,'2. Metadata'!C$6,IF(B14='2. Metadata'!D$1,'2. Metadata'!D$6, IF(B14='2. Metadata'!E$1,'2. Metadata'!E$6,IF( B14='2. Metadata'!F$1,'2. Metadata'!F$6,IF(B14='2. Metadata'!G$1,'2. Metadata'!G$6,IF(B14='2. Metadata'!H$1,'2. Metadata'!H$6, IF(B14='2. Metadata'!I$1,'2. Metadata'!I$6, IF(B14='2. Metadata'!J$1,'2. Metadata'!J$6, IF(B14='2. Metadata'!K$1,'2. Metadata'!K$6, IF(B14='2. Metadata'!L$1,'2. Metadata'!L$6, IF(B14='2. Metadata'!M$1,'2. Metadata'!M$6, IF(B14='2. Metadata'!N$1,'2. Metadata'!N$6))))))))))))))","v":-117.88417},"n/a",16.582,{"$f":"IF(ISBLANK(F14)=TRUE,\" \",'2. Metadata'!B$14)","v":"degrees Celsius"},13.594,{"$f":"IF(ISBLANK(H14)=TRUE,\" \",'2. Metadata'!B$26)","v":"degrees Celsius"},14.835,{"$f":"IF(ISBLANK(J14)=TRUE,\" \",'2. Metadata'!B$38)","v":"degrees Celsius"},"n/a"]
["2013-08-17","NECAR01",{"$f":"IF(ISBLANK(B15)=TRUE,\" \", IF(B15='2. Metadata'!B$1,'2. Metadata'!B$5, IF(B15='2. Metadata'!C$1,'2. Metadata'!C$5,IF(B15='2. Metadata'!D$1,'2. Metadata'!D$5, IF(B15='2. Metadata'!E$1,'2. Metadata'!E$5,IF( B15='2. Metadata'!F$1,'2. Metadata'!F$5,IF(B15='2. Metadata'!G$1,'2. Metadata'!G$5,IF(B15='2. Metadata'!H$1,'2. Metadata'!H$5, IF(B15='2. Metadata'!I$1,'2. Metadata'!I$5, IF(B15='2. Metadata'!J$1,'2. Metadata'!J$5, IF(B15='2. Metadata'!K$1,'2. Metadata'!K$5, IF(B15='2. Metadata'!L$1,'2. Metadata'!L$5, IF(B15='2. Metadata'!M$1,'2. Metadata'!M$5, IF(B15='2. Metadata'!N$1,'2. Metadata'!N$5))))))))))))))","v":49.97944},{"$f":"IF(ISBLANK(B15)=TRUE,\" \", IF(B15='2. Metadata'!B$1,'2. Metadata'!B$6, IF(B15='2. Metadata'!C$1,'2. Metadata'!C$6,IF(B15='2. Metadata'!D$1,'2. Metadata'!D$6, IF(B15='2. Metadata'!E$1,'2. Metadata'!E$6,IF( B15='2. Metadata'!F$1,'2. Metadata'!F$6,IF(B15='2. Metadata'!G$1,'2. Metadata'!G$6,IF(B15='2. Metadata'!H$1,'2. Metadata'!H$6, IF(B15='2. Metadata'!I$1,'2. Metadata'!I$6, IF(B15='2. Metadata'!J$1,'2. Metadata'!J$6, IF(B15='2. Metadata'!K$1,'2. Metadata'!K$6, IF(B15='2. Metadata'!L$1,'2. Metadata'!L$6, IF(B15='2. Metadata'!M$1,'2. Metadata'!M$6, IF(B15='2. Metadata'!N$1,'2. Metadata'!N$6))))))))))))))","v":-117.88417},"n/a",15.485,{"$f":"IF(ISBLANK(F15)=TRUE,\" \",'2. Metadata'!B$14)","v":"degrees Celsius"},13.281,{"$f":"IF(ISBLANK(H15)=TRUE,\" \",'2. Metadata'!B$26)","v":"degrees Celsius"},14.325,{"$f":"IF(ISBLANK(J15)=TRUE,\" \",'2. Metadata'!B$38)","v":"degrees Celsius"},"n/a"]
["2013-08-18","NECAR01",{"$f":"IF(ISBLANK(B16)=TRUE,\" \", IF(B16='2. Metadata'!B$1,'2. Metadata'!B$5, IF(B16='2. Metadata'!C$1,'2. Metadata'!C$5,IF(B16='2. Metadata'!D$1,'2. Metadata'!D$5, IF(B16='2. Metadata'!E$1,'2. Metadata'!E$5,IF( B16='2. Metadata'!F$1,'2. Metadata'!F$5,IF(B16='2. Metadata'!G$1,'2. Metadata'!G$5,IF(B16='2. Metadata'!H$1,'2. Metadata'!H$5, IF(B16='2. Metadata'!I$1,'2. Metadata'!I$5, IF(B16='2. Metadata'!J$1,'2. Metadata'!J$5, IF(B16='2. Metadata'!K$1,'2. Metadata'!K$5, IF(B16='2. Metadata'!L$1,'2. Metadata'!L$5, IF(B16='2. Metadata'!M$1,'2. Metadata'!M$5, IF(B16='2. Metadata'!N$1,'2. Metadata'!N$5))))))))))))))","v":49.97944},{"$f":"IF(ISBLANK(B16)=TRUE,\" \", IF(B16='2. Metadata'!B$1,'2. Metadata'!B$6, IF(B16='2. Metadata'!C$1,'2. Metadata'!C$6,IF(B16='2. Metadata'!D$1,'2. Metadata'!D$6, IF(B16='2. Metadata'!E$1,'2. Metadata'!E$6,IF( B16='2. Metadata'!F$1,'2. Metadata'!F$6,IF(B16='2. Metadata'!G$1,'2. Metadata'!G$6,IF(B16='2. Metadata'!H$1,'2. Metadata'!H$6, IF(B16='2. Metadata'!I$1,'2. Metadata'!I$6, IF(B16='2. Metadata'!J$1,'2. Metadata'!J$6, IF(B16='2. Metadata'!K$1,'2. Metadata'!K$6, IF(B16='2. Metadata'!L$1,'2. Metadata'!L$6, IF(B16='2. Metadata'!M$1,'2. Metadata'!M$6, IF(B16='2. Metadata'!N$1,'2. Metadata'!N$6))))))))))))))","v":-117.88417},"n/a",16.344,{"$f":"IF(ISBLANK(F16)=TRUE,\" \",'2. Metadata'!B$14)","v":"degrees Celsius"},12.847,{"$f":"IF(ISBLANK(H16)=TRUE,\" \",'2. Metadata'!B$26)","v":"degrees Celsius"},14.331,{"$f":"IF(ISBLANK(J16)=TRUE,\" \",'2. Metadata'!B$38)","v":"degrees Celsius"},"n/a"]
["2013-08-19","NECAR01",{"$f":"IF(ISBLANK(B17)=TRUE,\" \", IF(B17='2. Metadata'!B$1,'2. Metadata'!B$5, IF(B17='2. Metadata'!C$1,'2. Metadata'!C$5,IF(B17='2. Metadata'!D$1,'2. Metadata'!D$5, IF(B17='2. Metadata'!E$1,'2. Metadata'!E$5,IF( B17='2. Metadata'!F$1,'2. Metadata'!F$5,IF(B17='2. Metadata'!G$1,'2. Metadata'!G$5,IF(B17='2. Metadata'!H$1,'2. Metadata'!H$5, IF(B17='2. Metadata'!I$1,'2. Metadata'!I$5, IF(B17='2. Metadata'!J$1,'2. Metadata'!J$5, IF(B17='2. Metadata'!K$1,'2. Metadata'!K$5, IF(B17='2. Metadata'!L$1,'2. Metadata'!L$5, IF(B17='2. Metadata'!M$1,'2. Metadata'!M$5, IF(B17='2. Metadata'!N$1,'2. Metadata'!N$5))))))))))))))","v":49.97944},{"$f":"IF(ISBLANK(B17)=TRUE,\" \", IF(B17='2. Metadata'!B$1,'2. Metadata'!B$6, IF(B17='2. Metadata'!C$1,'2. Metadata'!C$6,IF(B17='2. Metadata'!D$1,'2. Metadata'!D$6, IF(B17='2. Metadata'!E$1,'2. Metadata'!E$6,IF( B17='2. Metadata'!F$1,'2. Metadata'!F$6,IF(B17='2. Metadata'!G$1,'2. Metadata'!G$6,IF(B17='2. Metadata'!H$1,'2. Metadata'!H$6, IF(B17='2. Metadata'!I$1,'2. Metadata'!I$6, IF(B17='2. Metadata'!J$1,'2. Metadata'!J$6, IF(B17='2. Metadata'!K$1,'2. Metadata'!K$6, IF(B17='2. Metadata'!L$1,'2. Metadata'!L$6, IF(B17='2. Metadata'!M$1,'2. Metadata'!M$6, IF(B17='2. Metadata'!N$1,'2. Metadata'!N$6))))))))))))))","v":-117.88417},"n/a",16.01,{"$f":"IF(ISBLANK(F17)=TRUE,\" \",'2. Metadata'!B$14)","v":"degrees Celsius"},12.847,{"$f":"IF(ISBLANK(H17)=TRUE,\" \",'2. Metadata'!B$26)","v":"degrees Celsius"},14.215,{"$f":"IF(ISBLANK(J17)=TRUE,\" \",'2. Metadata'!B$38)","v":"degrees Celsius"},"n/a"]
["2013-08-20","NECAR01",{"$f":"IF(ISBLANK(B18)=TRUE,\" \", IF(B18='2. Metadata'!B$1,'2. Metadata'!B$5, IF(B18='2. Metadata'!C$1,'2. Metadata'!C$5,IF(B18='2. Metadata'!D$1,'2. Metadata'!D$5, IF(B18='2. Metadata'!E$1,'2. Metadata'!E$5,IF( B18='2. Metadata'!F$1,'2. Metadata'!F$5,IF(B18='2. Metadata'!G$1,'2. Metadata'!G$5,IF(B18='2. Metadata'!H$1,'2. Metadata'!H$5, IF(B18='2. Metadata'!I$1,'2. Metadata'!I$5, IF(B18='2. Metadata'!J$1,'2. Metadata'!J$5, IF(B18='2. Metadata'!K$1,'2. Metadata'!K$5, IF(B18='2. Metadata'!L$1,'2. Metadata'!L$5, IF(B18='2. Metadata'!M$1,'2. Metadata'!M$5, IF(B18='2. Metadata'!N$1,'2. Metadata'!N$5))))))))))))))","v":49.97944},{"$f":"IF(ISBLANK(B18)=TRUE,\" \", IF(B18='2. Metadata'!B$1,'2. Metadata'!B$6, IF(B18='2. Metadata'!C$1,'2. Metadata'!C$6,IF(B18='2. Metadata'!D$1,'2. Metadata'!D$6, IF(B18='2. Metadata'!E$1,'2. Metadata'!E$6,IF( B18='2. Metadata'!F$1,'2. Metadata'!F$6,IF(B18='2. Metadata'!G$1,'2. Metadata'!G$6,IF(B18='2. Metadata'!H$1,'2. Metadata'!H$6, IF(B18='2. Metadata'!I$1,'2. Metadata'!I$6, IF(B18='2. Metadata'!J$1,'2. Metadata'!J$6, IF(B18='2. Metadata'!K$1,'2. Metadata'!K$6, IF(B18='2. Metadata'!L$1,'2. Metadata'!L$6, IF(B18='2. Metadata'!M$1,'2. Metadata'!M$6, IF(B18='2. Metadata'!N$1,'2. Metadata'!N$6))))))))))))))","v":-117.88417},"n/a",15.605,{"$f":"IF(ISBLANK(F18)=TRUE,\" \",'2. Metadata'!B$14)","v":"degrees Celsius"},11.856,{"$f":"IF(ISBLANK(H18)=TRUE,\" \",'2. Metadata'!B$26)","v":"degrees Celsius"},13.47,{"$f":"IF(ISBLANK(J18)=TRUE,\" \",'2. Metadata'!B$38)","v":"degrees Celsius"},"n/a"]
["2013-08-21","NECAR01",{"$f":"IF(ISBLANK(B19)=TRUE,\" \", IF(B19='2. Metadata'!B$1,'2. Metadata'!B$5, IF(B19='2. Metadata'!C$1,'2. Metadata'!C$5,IF(B19='2. Metadata'!D$1,'2. Metadata'!D$5, IF(B19='2. Metadata'!E$1,'2. Metadata'!E$5,IF( B19='2. Metadata'!F$1,'2. Metadata'!F$5,IF(B19='2. Metadata'!G$1,'2. Metadata'!G$5,IF(B19='2. Metadata'!H$1,'2. Metadata'!H$5, IF(B19='2. Metadata'!I$1,'2. Metadata'!I$5, IF(B19='2. Metadata'!J$1,'2. Metadata'!J$5, IF(B19='2. Metadata'!K$1,'2. Metadata'!K$5, IF(B19='2. Metadata'!L$1,'2. Metadata'!L$5, IF(B19='2. Metadata'!M$1,'2. Metadata'!M$5, IF(B19='2. Metadata'!N$1,'2. Metadata'!N$5))))))))))))))","v":49.97944},{"$f":"IF(ISBLANK(B19)=TRUE,\" \", IF(B19='2. Metadata'!B$1,'2. Metadata'!B$6, IF(B19='2. Metadata'!C$1,'2. Metadata'!C$6,IF(B19='2. Metadata'!D$1,'2. Metadata'!D$6, IF(B19='2. Metadata'!E$1,'2. Metadata'!E$6,IF( B19='2. Metadata'!F$1,'2. Metadata'!F$6,IF(B19='2. Metadata'!G$1,'2. Metadata'!G$6,IF(B19='2. Metadata'!H$1,'2. Metadata'!H$6, IF(B19='2. Metadata'!I$1,'2. Metadata'!I$6, IF(B19='2. Metadata'!J$1,'2. Metadata'!J$6, IF(B19='2. Metadata'!K$1,'2. Metadata'!K$6, IF(B19='2. Metadata'!L$1,'2. Metadata'!L$6, IF(B19='2. Metadata'!M$1,'2. Metadata'!M$6, IF(B19='2. Metadata'!N$1,'2. Metadata'!N$6))))))))))))))","v":-117.88417},"n/a",14.888,{"$f":"IF(ISBLANK(F19)=TRUE,\" \",'2. Metadata'!B$14)","v":"degrees Celsius"},11.029,{"$f":"IF(ISBLANK(H19)=TRUE,\" \",'2. Metadata'!B$26)","v":"degrees Celsius"},12.772,{"$f":"IF(ISBLANK(J19)=TRUE,\" \",'2. Metadata'!B$38)","v":"degrees Celsius"},"n/a"]
["2013-08-22","NECAR01",{"$f":"IF(ISBLANK(B20)=TRUE,\" \", IF(B20='2. Metadata'!B$1,'2. Metadata'!B$5, IF(B20='2. Metadata'!C$1,'2. Metadata'!C$5,IF(B20='2. Metadata'!D$1,'2. Metadata'!D$5, IF(B20='2. Metadata'!E$1,'2. Metadata'!E$5,IF( B20='2. Metadata'!F$1,'2. Metadata'!F$5,IF(B20='2. Metadata'!G$1,'2. Metadata'!G$5,IF(B20='2. Metadata'!H$1,'2. Metadata'!H$5, IF(B20='2. Metadata'!I$1,'2. Metadata'!I$5, IF(B20='2. Metadata'!J$1,'2. Metadata'!J$5, IF(B20='2. Metadata'!K$1,'2. Metadata'!K$5, IF(B20='2. Metadata'!L$1,'2. Metadata'!L$5, IF(B20='2. Metadata'!M$1,'2. Metadata'!M$5, IF(B20='2. Metadata'!N$1,'2. Metadata'!N$5))))))))))))))","v":49.97944},{"$f":"IF(ISBLANK(B20)=TRUE,\" \", IF(B20='2. Metadata'!B$1,'2. Metadata'!B$6, IF(B20='2. Metadata'!C$1,'2. Metadata'!C$6,IF(B20='2. Metadata'!D$1,'2. Metadata'!D$6, IF(B20='2. Metadata'!E$1,'2. Metadata'!E$6,IF( B20='2. Metadata'!F$1,'2. Metadata'!F$6,IF(B20='2. Metadata'!G$1,'2. Metadata'!G$6,IF(B20='2. Metadata'!H$1,'2. Metadata'!H$6, IF(B20='2. Metadata'!I$1,'2. Metadata'!I$6, IF(B20='2. Metadata'!J$1,'2. Metadata'!J$6, IF(B20='2. Metadata'!K$1,'2. Metadata'!K$6, IF(B20='2. Metadata'!L$1,'2. Metadata'!L$6, IF(B20='2. Metadata'!M$1,'2. Metadata'!M$6, IF(B20='2. Metadata'!N$1,'2. Metadata'!N$6))))))))))))))","v":-117.88417},"n/a",14.529,{"$f":"IF(ISBLANK(F20)=TRUE,\" \",'2. Metadata'!B$14)","v":"degrees Celsius"},10.98,{"$f":"IF(ISBLANK(H20)=TRUE,\" \",'2. Metadata'!B$26)","v":"degrees Celsius"},12.692,{"$f":"IF(ISBLANK(J20)=TRUE,\" \",'2. Metadata'!B$38)","v":"degrees Celsius"},"n/a"]
["2013-08-23","NECAR01",{"$f":"IF(ISBLANK(B21)=TRUE,\" \", IF(B21='2. Metadata'!B$1,'2. Metadata'!B$5, IF(B21='2. Metadata'!C$1,'2. Metadata'!C$5,IF(B21='2. Metadata'!D$1,'2. Metadata'!D$5, IF(B21='2. Metadata'!E$1,'2. Metadata'!E$5,IF( B21='2. Metadata'!F$1,'2. Metadata'!F$5,IF(B21='2. Metadata'!G$1,'2. Metadata'!G$5,IF(B21='2. Metadata'!H$1,'2. Metadata'!H$5, IF(B21='2. Metadata'!I$1,'2. Metadata'!I$5, IF(B21='2. Metadata'!J$1,'2. Metadata'!J$5, IF(B21='2. Metadata'!K$1,'2. Metadata'!K$5, IF(B21='2. Metadata'!L$1,'2. Metadata'!L$5, IF(B21='2. Metadata'!M$1,'2. Metadata'!M$5, IF(B21='2. Metadata'!N$1,'2. Metadata'!N$5))))))))))))))","v":49.97944},{"$f":"IF(ISBLANK(B21)=TRUE,\" \", IF(B21='2. Metadata'!B$1,'2. Metadata'!B$6, IF(B21='2. Metadata'!C$1,'2. Metadata'!C$6,IF(B21='2. Metadata'!D$1,'2. Metadata'!D$6, IF(B21='2. Metadata'!E$1,'2. Metadata'!E$6,IF( B21='2. Metadata'!F$1,'2. Metadata'!F$6,IF(B21='2. Metadata'!G$1,'2. Metadata'!G$6,IF(B21='2. Metadata'!H$1,'2. Metadata'!H$6, IF(B21='2. Metadata'!I$1,'2. Metadata'!I$6, IF(B21='2. Metadata'!J$1,'2. Metadata'!J$6, IF(B21='2. Metadata'!K$1,'2. Metadata'!K$6, IF(B21='2. Metadata'!L$1,'2. Metadata'!L$6, IF(B21='2. Metadata'!M$1,'2. Metadata'!M$6, IF(B21='2. Metadata'!N$1,'2. Metadata'!N$6))))))))))))))","v":-117.88417},"n/a",13.088,{"$f":"IF(ISBLANK(F21)=TRUE,\" \",'2. Metadata'!B$14)","v":"degrees Celsius"},11.953,{"$f":"IF(ISBLANK(H21)=TRUE,\" \",'2. Metadata'!B$26)","v":"degrees Celsius"},12.411,{"$f":"IF(ISBLANK(J21)=TRUE,\" \",'2. Metadata'!B$38)","v":"degrees Celsius"},"n/a"]
["2013-08-24","NECAR01",{"$f":"IF(ISBLANK(B22)=TRUE,\" \", IF(B22='2. Metadata'!B$1,'2. Metadata'!B$5, IF(B22='2. Metadata'!C$1,'2. Metadata'!C$5,IF(B22='2. Metadata'!D$1,'2. Metadata'!D$5, IF(B22='2. Metadata'!E$1,'2. Metadata'!E$5,IF( B22='2. Metadata'!F$1,'2. Metadata'!F$5,IF(B22='2. Metadata'!G$1,'2. Metadata'!G$5,IF(B22='2. Metadata'!H$1,'2. Metadata'!H$5, IF(B22='2. Metadata'!I$1,'2. Metadata'!I$5, IF(B22='2. Metadata'!J$1,'2. Metadata'!J$5, IF(B22='2. Metadata'!K$1,'2. Metadata'!K$5, IF(B22='2. Metadata'!L$1,'2. Metadata'!L$5, IF(B22='2. Metadata'!M$1,'2. Metadata'!M$5, IF(B22='2. Metadata'!N$1,'2. Metadata'!N$5))))))))))))))","v":49.97944},{"$f":"IF(ISBLANK(B22)=TRUE,\" \", IF(B22='2. Metadata'!B$1,'2. Metadata'!B$6, IF(B22='2. Metadata'!C$1,'2. Metadata'!C$6,IF(B22='2. Metadata'!D$1,'2. Metadata'!D$6, IF(B22='2. Metadata'!E$1,'2. Metadata'!E$6,IF( B22='2. Metadata'!F$1,'2. Metadata'!F$6,IF(B22='2. Metadata'!G$1,'2. Metadata'!G$6,IF(B22='2. Metadata'!H$1,'2. Metadata'!H$6, IF(B22='2. Metadata'!I$1,'2. Metadata'!I$6, IF(B22='2. Metadata'!J$1,'2. Metadata'!J$6, IF(B22='2. Metadata'!K$1,'2. Metadata'!K$6, IF(B22='2. Metadata'!L$1,'2. Metadata'!L$6, IF(B22='2. Metadata'!M$1,'2. Metadata'!M$6, IF(B22='2. Metadata'!N$1,'2. Metadata'!N$6))))))))))))))","v":-117.88417},"n/a",13.161,{"$f":"IF(ISBLANK(F22)=TRUE,\" \",'2. Metadata'!B$14)","v":"degrees Celsius"},11.297,{"$f":"IF(ISBLANK(H22)=TRUE,\" \",'2. Metadata'!B$26)","v":"degrees Celsius"},12.17,{"$f":"IF(ISBLANK(J22)=TRUE,\" \",'2. Metadata'!B$38)","v":"degrees Celsius"},"n/a"]
["2013-08-25","NECAR01",{"$f":"IF(ISBLANK(B23)=TRUE,\" \", IF(B23='2. Metadata'!B$1,'2. Metadata'!B$5, IF(B23='2. Metadata'!C$1,'2. Metadata'!C$5,IF(B23='2. Metadata'!D$1,'2. Metadata'!D$5, IF(B23='2. Metadata'!E$1,'2. Metadata'!E$5,IF( B23='2. Metadata'!F$1,'2. Metadata'!F$5,IF(B23='2. Metadata'!G$1,'2. Metadata'!G$5,IF(B23='2. Metadata'!H$1,'2. Metadata'!H$5, IF(B23='2. Metadata'!I$1,'2. Metadata'!I$5, IF(B23='2. Metadata'!J$1,'2. Metadata'!J$5, IF(B23='2. Metadata'!K$1,'2. Metadata'!K$5, IF(B23='2. Metadata'!L$1,'2. Metadata'!L$5, IF(B23='2. Metadata'!M$1,'2. Metadata'!M$5, IF(B23='2. Metadata'!N$1,'2. Metadata'!N$5))))))))))))))","v":49.97944},{"$f":"IF(ISBLANK(B23)=TRUE,\" \", IF(B23='2. Metadata'!B$1,'2. Metadata'!B$6, IF(B23='2. Metadata'!C$1,'2. Metadata'!C$6,IF(B23='2. Metadata'!D$1,'2. Metadata'!D$6, IF(B23='2. Metadata'!E$1,'2. Metadata'!E$6,IF( B23='2. Metadata'!F$1,'2. Metadata'!F$6,IF(B23='2. Metadata'!G$1,'2. Metadata'!G$6,IF(B23='2. Metadata'!H$1,'2. Metadata'!H$6, IF(B23='2. Metadata'!I$1,'2. Metadata'!I$6, IF(B23='2. Metadata'!J$1,'2. Metadata'!J$6, IF(B23='2. Metadata'!K$1,'2. Metadata'!K$6, IF(B23='2. Metadata'!L$1,'2. Metadata'!L$6, IF(B23='2. Metadata'!M$1,'2. Metadata'!M$6, IF(B23='2. Metadata'!N$1,'2. Metadata'!N$6))))))))))))))","v":-117.88417},"n/a",13.762,{"$f":"IF(ISBLANK(F23)=TRUE,\" \",'2. Metadata'!B$14)","v":"degrees Celsius"},11.346,{"$f":"IF(ISBLANK(H23)=TRUE,\" \",'2. Metadata'!B$26)","v":"degrees Celsius"},12.69,{"$f":"IF(ISBLANK(J23)=TRUE,\" \",'2. Metadata'!B$38)","v":"degrees Celsius"},"n/a"]
["2013-08-26","NECAR01",{"$f":"IF(ISBLANK(B24)=TRUE,\" \", IF(B24='2. Metadata'!B$1,'2. Metadata'!B$5, IF(B24='2. Metadata'!C$1,'2. Metadata'!C$5,IF(B24='2. Metadata'!D$1,'2. Metadata'!D$5, IF(B24='2. Metadata'!E$1,'2. Metadata'!E$5,IF( B24='2. Metadata'!F$1,'2. Metadata'!F$5,IF(B24='2. Metadata'!G$1,'2. Metadata'!G$5,IF(B24='2. Metadata'!H$1,'2. Metadata'!H$5, IF(B24='2. Metadata'!I$1,'2. Metadata'!I$5, IF(B24='2. Metadata'!J$1,'2. Metadata'!J$5, IF(B24='2. Metadata'!K$1,'2. Metadata'!K$5, IF(B24='2. Metadata'!L$1,'2. Metadata'!L$5, IF(B24='2. Metadata'!M$1,'2. Metadata'!M$5, IF(B24='2. Metadata'!N$1,'2. Metadata'!N$5))))))))))))))","v":49.97944},{"$f":"IF(ISBLANK(B24)=TRUE,\" \", IF(B24='2. Metadata'!B$1,'2. Metadata'!B$6, IF(B24='2. Metadata'!C$1,'2. Metadata'!C$6,IF(B24='2. Metadata'!D$1,'2. Metadata'!D$6, IF(B24='2. Metadata'!E$1,'2. Metadata'!E$6,IF( B24='2. Metadata'!F$1,'2. Metadata'!F$6,IF(B24='2. Metadata'!G$1,'2. Metadata'!G$6,IF(B24='2. Metadata'!H$1,'2. Metadata'!H$6, IF(B24='2. Metadata'!I$1,'2. Metadata'!I$6, IF(B24='2. Metadata'!J$1,'2. Metadata'!J$6, IF(B24='2. Metadata'!K$1,'2. Metadata'!K$6, IF(B24='2. Metadata'!L$1,'2. Metadata'!L$6, IF(B24='2. Metadata'!M$1,'2. Metadata'!M$6, IF(B24='2. Metadata'!N$1,'2. Metadata'!N$6))))))))))))))","v":-117.88417},"n/a",13.81,{"$f":"IF(ISBLANK(F24)=TRUE,\" \",'2. Metadata'!B$14)","v":"degrees Celsius"},11.953,{"$f":"IF(ISBLANK(H24)=TRUE,\" \",'2. Metadata'!B$26)","v":"degrees Celsius"},12.831,{"$f":"IF(ISBLANK(J24)=TRUE,\" \",'2. Metadata'!B$38)","v":"degrees Celsius"},"n/a"]
["2013-08-27","NECAR01",{"$f":"IF(ISBLANK(B25)=TRUE,\" \", IF(B25='2. Metadata'!B$1,'2. Metadata'!B$5, IF(B25='2. Metadata'!C$1,'2. Metadata'!C$5,IF(B25='2. Metadata'!D$1,'2. Metadata'!D$5, IF(B25='2. Metadata'!E$1,'2. Metadata'!E$5,IF( B25='2. Metadata'!F$1,'2. Metadata'!F$5,IF(B25='2. Metadata'!G$1,'2. Metadata'!G$5,IF(B25='2. Metadata'!H$1,'2. Metadata'!H$5, IF(B25='2. Metadata'!I$1,'2. Metadata'!I$5, IF(B25='2. Metadata'!J$1,'2. Metadata'!J$5, IF(B25='2. Metadata'!K$1,'2. Metadata'!K$5, IF(B25='2. Metadata'!L$1,'2. Metadata'!L$5, IF(B25='2. Metadata'!M$1,'2. Metadata'!M$5, IF(B25='2. Metadata'!N$1,'2. Metadata'!N$5))))))))))))))","v":49.97944},{"$f":"IF(ISBLANK(B25)=TRUE,\" \", IF(B25='2. Metadata'!B$1,'2. Metadata'!B$6, IF(B25='2. Metadata'!C$1,'2. Metadata'!C$6,IF(B25='2. Metadata'!D$1,'2. Metadata'!D$6, IF(B25='2. Metadata'!E$1,'2. Metadata'!E$6,IF( B25='2. Metadata'!F$1,'2. Metadata'!F$6,IF(B25='2. Metadata'!G$1,'2. Metadata'!G$6,IF(B25='2. Metadata'!H$1,'2. Metadata'!H$6, IF(B25='2. Metadata'!I$1,'2. Metadata'!I$6, IF(B25='2. Metadata'!J$1,'2. Metadata'!J$6, IF(B25='2. Metadata'!K$1,'2. Metadata'!K$6, IF(B25='2. Metadata'!L$1,'2. Metadata'!L$6, IF(B25='2. Metadata'!M$1,'2. Metadata'!M$6, IF(B25='2. Metadata'!N$1,'2. Metadata'!N$6))))))))))))))","v":-117.88417},"n/a",14.577,{"$f":"IF(ISBLANK(F25)=TRUE,\" \",'2. Metadata'!B$14)","v":"degrees Celsius"},11.856,{"$f":"IF(ISBLANK(H25)=TRUE,\" \",'2. Metadata'!B$26)","v":"degrees Celsius"},13.179,{"$f":"IF(ISBLANK(J25)=TRUE,\" \",'2. Metadata'!B$38)","v":"degrees Celsius"},"n/a"]
["2013-08-28","NECAR01",{"$f":"IF(ISBLANK(B26)=TRUE,\" \", IF(B26='2. Metadata'!B$1,'2. Metadata'!B$5, IF(B26='2. Metadata'!C$1,'2. Metadata'!C$5,IF(B26='2. Metadata'!D$1,'2. Metadata'!D$5, IF(B26='2. Metadata'!E$1,'2. Metadata'!E$5,IF( B26='2. Metadata'!F$1,'2. Metadata'!F$5,IF(B26='2. Metadata'!G$1,'2. Metadata'!G$5,IF(B26='2. Metadata'!H$1,'2. Metadata'!H$5, IF(B26='2. Metadata'!I$1,'2. Metadata'!I$5, IF(B26='2. Metadata'!J$1,'2. Metadata'!J$5, IF(B26='2. Metadata'!K$1,'2. Metadata'!K$5, IF(B26='2. Metadata'!L$1,'2. Metadata'!L$5, IF(B26='2. Metadata'!M$1,'2. Metadata'!M$5, IF(B26='2. Metadata'!N$1,'2. Metadata'!N$5))))))))))))))","v":49.97944},{"$f":"IF(ISBLANK(B26)=TRUE,\" \", IF(B26='2. Metadata'!B$1,'2. Metadata'!B$6, IF(B26='2. Metadata'!C$1,'2. Metadata'!C$6,IF(B26='2. Metadata'!D$1,'2. Metadata'!D$6, IF(B26='2. Metadata'!E$1,'2. Metadata'!E$6,IF( B26='2. Metadata'!F$1,'2. Metadata'!F$6,IF(B26='2. Metadata'!G$1,'2. Metadata'!G$6,IF(B26='2. Metadata'!H$1,'2. Metadata'!H$6, IF(B26='2. Metadata'!I$1,'2. Metadata'!I$6, IF(B26='2. Metadata'!J$1,'2. Metadata'!J$6, IF(B26='2. Metadata'!K$1,'2. Metadata'!K$6, IF(B26='2. Metadata'!L$1,'2. Metadata'!L$6, IF(B26='2. Metadata'!M$1,'2. Metadata'!M$6, IF(B26='2. Metadata'!N$1,'2. Metadata'!N$6))))))))))))))","v":-117.88417},"n/a",14.936,{"$f":"IF(ISBLANK(F26)=TRUE,\" \",'2. Metadata'!B$14)","v":"degrees Celsius"},11.565,{"$f":"IF(ISBLANK(H26)=TRUE,\" \",'2. Metadata'!B$26)","v":"degrees Celsius"},13.161,{"$f":"IF(ISBLANK(J26)=TRUE,\" \",'2. Metadata'!B$38)","v":"degrees Celsius"},"n/a"]
["2013-08-29","NECAR01",{"$f":"IF(ISBLANK(B27)=TRUE,\" \", IF(B27='2. Metadata'!B$1,'2. Metadata'!B$5, IF(B27='2. Metadata'!C$1,'2. Metadata'!C$5,IF(B27='2. Metadata'!D$1,'2. Metadata'!D$5, IF(B27='2. Metadata'!E$1,'2. Metadata'!E$5,IF( B27='2. Metadata'!F$1,'2. Metadata'!F$5,IF(B27='2. Metadata'!G$1,'2. Metadata'!G$5,IF(B27='2. Metadata'!H$1,'2. Metadata'!H$5, IF(B27='2. Metadata'!I$1,'2. Metadata'!I$5, IF(B27='2. Metadata'!J$1,'2. Metadata'!J$5, IF(B27='2. Metadata'!K$1,'2. Metadata'!K$5, IF(B27='2. Metadata'!L$1,'2. Metadata'!L$5, IF(B27='2. Metadata'!M$1,'2. Metadata'!M$5, IF(B27='2. Metadata'!N$1,'2. Metadata'!N$5))))))))))))))","v":49.97944},{"$f":"IF(ISBLANK(B27)=TRUE,\" \", IF(B27='2. Metadata'!B$1,'2. Metadata'!B$6, IF(B27='2. Metadata'!C$1,'2. Metadata'!C$6,IF(B27='2. Metadata'!D$1,'2. Metadata'!D$6, IF(B27='2. Metadata'!E$1,'2. Metadata'!E$6,IF( B27='2. Metadata'!F$1,'2. Metadata'!F$6,IF(B27='2. Metadata'!G$1,'2. Metadata'!G$6,IF(B27='2. Metadata'!H$1,'2. Metadata'!H$6, IF(B27='2. Metadata'!I$1,'2. Metadata'!I$6, IF(B27='2. Metadata'!J$1,'2. Metadata'!J$6, IF(B27='2. Metadata'!K$1,'2. Metadata'!K$6, IF(B27='2. Metadata'!L$1,'2. Metadata'!L$6, IF(B27='2. Metadata'!M$1,'2. Metadata'!M$6, IF(B27='2. Metadata'!N$1,'2. Metadata'!N$6))))))))))))))","v":-117.88417},"n/a",14.816,{"$f":"IF(ISBLANK(F27)=TRUE,\" \",'2. Metadata'!B$14)","v":"degrees Celsius"},12.364,{"$f":"IF(ISBLANK(H27)=TRUE,\" \",'2. Metadata'!B$26)","v":"degrees Celsius"},13.414,{"$f":"IF(ISBLANK(J27)=TRUE,\" \",'2. Metadata'!B$38)","v":"degrees Celsius"},"n/a"]
["2013-08-30","NECAR01",{"$f":"IF(ISBLANK(B28)=TRUE,\" \", IF(B28='2. Metadata'!B$1,'2. Metadata'!B$5, IF(B28='2. Metadata'!C$1,'2. Metadata'!C$5,IF(B28='2. Metadata'!D$1,'2. Metadata'!D$5, IF(B28='2. Metadata'!E$1,'2. Metadata'!E$5,IF( B28='2. Metadata'!F$1,'2. Metadata'!F$5,IF(B28='2. Metadata'!G$1,'2. Metadata'!G$5,IF(B28='2. Metadata'!H$1,'2. Metadata'!H$5, IF(B28='2. Metadata'!I$1,'2. Metadata'!I$5, IF(B28='2. Metadata'!J$1,'2. Metadata'!J$5, IF(B28='2. Metadata'!K$1,'2. Metadata'!K$5, IF(B28='2. Metadata'!L$1,'2. Metadata'!L$5, IF(B28='2. Metadata'!M$1,'2. Metadata'!M$5, IF(B28='2. Metadata'!N$1,'2. Metadata'!N$5))))))))))))))","v":49.97944},{"$f":"IF(ISBLANK(B28)=TRUE,\" \", IF(B28='2. Metadata'!B$1,'2. Metadata'!B$6, IF(B28='2. Metadata'!C$1,'2. Metadata'!C$6,IF(B28='2. Metadata'!D$1,'2. Metadata'!D$6, IF(B28='2. Metadata'!E$1,'2. Metadata'!E$6,IF( B28='2. Metadata'!F$1,'2. Metadata'!F$6,IF(B28='2. Metadata'!G$1,'2. Metadata'!G$6,IF(B28='2. Metadata'!H$1,'2. Metadata'!H$6, IF(B28='2. Metadata'!I$1,'2. Metadata'!I$6, IF(B28='2. Metadata'!J$1,'2. Metadata'!J$6, IF(B28='2. Metadata'!K$1,'2. Metadata'!K$6, IF(B28='2. Metadata'!L$1,'2. Metadata'!L$6, IF(B28='2. Metadata'!M$1,'2. Metadata'!M$6, IF(B28='2. Metadata'!N$1,'2. Metadata'!N$6))))))))))))))","v":-117.88417},"n/a",14.745,{"$f":"IF(ISBLANK(F28)=TRUE,\" \",'2. Metadata'!B$14)","v":"degrees Celsius"},12.074,{"$f":"IF(ISBLANK(H28)=TRUE,\" \",'2. Metadata'!B$26)","v":"degrees Celsius"},12.942,{"$f":"IF(ISBLANK(J28)=TRUE,\" \",'2. Metadata'!B$38)","v":"degrees Celsius"},"n/a"]
["2013-08-31","NECAR01",{"$f":"IF(ISBLANK(B29)=TRUE,\" \", IF(B29='2. Metadata'!B$1,'2. Metadata'!B$5, IF(B29='2. Metadata'!C$1,'2. Metadata'!C$5,IF(B29='2. Metadata'!D$1,'2. Metadata'!D$5, IF(B29='2. Metadata'!E$1,'2. Metadata'!E$5,IF( B29='2. Metadata'!F$1,'2. Metadata'!F$5,IF(B29='2. Metadata'!G$1,'2. Metadata'!G$5,IF(B29='2. Metadata'!H$1,'2. Metadata'!H$5, IF(B29='2. Metadata'!I$1,'2. Metadata'!I$5, IF(B29='2. Metadata'!J$1,'2. Metadata'!J$5, IF(B29='2. Metadata'!K$1,'2. Metadata'!K$5, IF(B29='2. Metadata'!L$1,'2. Metadata'!L$5, IF(B29='2. Metadata'!M$1,'2. Metadata'!M$5, IF(B29='2. Metadata'!N$1,'2. Metadata'!N$5))))))))))))))","v":49.97944},{"$f":"IF(ISBLANK(B29)=TRUE,\" \", IF(B29='2. Metadata'!B$1,'2. Metadata'!B$6, IF(B29='2. Metadata'!C$1,'2. Metadata'!C$6,IF(B29='2. Metadata'!D$1,'2. Metadata'!D$6, IF(B29='2. Metadata'!E$1,'2. Metadata'!E$6,IF( B29='2. Metadata'!F$1,'2. Metadata'!F$6,IF(B29='2. Metadata'!G$1,'2. Metadata'!G$6,IF(B29='2. Metadata'!H$1,'2. Metadata'!H$6, IF(B29='2. Metadata'!I$1,'2. Metadata'!I$6, IF(B29='2. Metadata'!J$1,'2. Metadata'!J$6, IF(B29='2. Metadata'!K$1,'2. Metadata'!K$6, IF(B29='2. Metadata'!L$1,'2. Metadata'!L$6, IF(B29='2. Metadata'!M$1,'2. Metadata'!M$6, IF(B29='2. Metadata'!N$1,'2. Metadata'!N$6))))))))))))))","v":-117.88417},"n/a",14.385,{"$f":"IF(ISBLANK(F29)=TRUE,\" \",'2. Metadata'!B$14)","v":"degrees Celsius"},10.834,{"$f":"IF(ISBLANK(H29)=TRUE,\" \",'2. Metadata'!B$26)","v":"degrees Celsius"},12.457,{"$f":"IF(ISBLANK(J29)=TRUE,\" \",'2. Metadata'!B$38)","v":"degrees Celsius"},"n/a"]
["2013-09-01","NECAR01",{"$f":"IF(ISBLANK(B30)=TRUE,\" \", IF(B30='2. Metadata'!B$1,'2. Metadata'!B$5, IF(B30='2. Metadata'!C$1,'2. Metadata'!C$5,IF(B30='2. Metadata'!D$1,'2. Metadata'!D$5, IF(B30='2. Metadata'!E$1,'2. Metadata'!E$5,IF( B30='2. Metadata'!F$1,'2. Metadata'!F$5,IF(B30='2. Metadata'!G$1,'2. Metadata'!G$5,IF(B30='2. Metadata'!H$1,'2. Metadata'!H$5, IF(B30='2. Metadata'!I$1,'2. Metadata'!I$5, IF(B30='2. Metadata'!J$1,'2. Metadata'!J$5, IF(B30='2. Metadata'!K$1,'2. Metadata'!K$5, IF(B30='2. Metadata'!L$1,'2. Metadata'!L$5, IF(B30='2. Metadata'!M$1,'2. Metadata'!M$5, IF(B30='2. Metadata'!N$1,'2. Metadata'!N$5))))))))))))))","v":49.97944},{"$f":"IF(ISBLANK(B30)=TRUE,\" \", IF(B30='2. Metadata'!B$1,'2. Metadata'!B$6, IF(B30='2. Metadata'!C$1,'2. Metadata'!C$6,IF(B30='2. Metadata'!D$1,'2. Metadata'!D$6, IF(B30='2. Metadata'!E$1,'2. Metadata'!E$6,IF( B30='2. Metadata'!F$1,'2. Metadata'!F$6,IF(B30='2. Metadata'!G$1,'2. Metadata'!G$6,IF(B30='2. Metadata'!H$1,'2. Metadata'!H$6, IF(B30='2. Metadata'!I$1,'2. Metadata'!I$6, IF(B30='2. Metadata'!J$1,'2. Metadata'!J$6, IF(B30='2. Metadata'!K$1,'2. Metadata'!K$6, IF(B30='2. Metadata'!L$1,'2. Metadata'!L$6, IF(B30='2. Metadata'!M$1,'2. Metadata'!M$6, IF(B30='2. Metadata'!N$1,'2. Metadata'!N$6))))))))))))))","v":-117.88417},"n/a",14.697,{"$f":"IF(ISBLANK(F30)=TRUE,\" \",'2. Metadata'!B$14)","v":"degrees Celsius"},10.883,{"$f":"IF(ISBLANK(H30)=TRUE,\" \",'2. Metadata'!B$26)","v":"degrees Celsius"},12.618,{"$f":"IF(ISBLANK(J30)=TRUE,\" \",'2. Metadata'!B$38)","v":"degrees Celsius"},"n/a"]
["2013-09-02","NECAR01",{"$f":"IF(ISBLANK(B31)=TRUE,\" \", IF(B31='2. Metadata'!B$1,'2. Metadata'!B$5, IF(B31='2. Metadata'!C$1,'2. Metadata'!C$5,IF(B31='2. Metadata'!D$1,'2. Metadata'!D$5, IF(B31='2. Metadata'!E$1,'2. Metadata'!E$5,IF( B31='2. Metadata'!F$1,'2. Metadata'!F$5,IF(B31='2. Metadata'!G$1,'2. Metadata'!G$5,IF(B31='2. Metadata'!H$1,'2. Metadata'!H$5, IF(B31='2. Metadata'!I$1,'2. Metadata'!I$5, IF(B31='2. Metadata'!J$1,'2. Metadata'!J$5, IF(B31='2. Metadata'!K$1,'2. Metadata'!K$5, IF(B31='2. Metadata'!L$1,'2. Metadata'!L$5, IF(B31='2. Metadata'!M$1,'2. Metadata'!M$5, IF(B31='2. Metadata'!N$1,'2. Metadata'!N$5))))))))))))))","v":49.97944},{"$f":"IF(ISBLANK(B31)=TRUE,\" \", IF(B31='2. Metadata'!B$1,'2. Metadata'!B$6, IF(B31='2. Metadata'!C$1,'2. Metadata'!C$6,IF(B31='2. Metadata'!D$1,'2. Metadata'!D$6, IF(B31='2. Metadata'!E$1,'2. Metadata'!E$6,IF( B31='2. Metadata'!F$1,'2. Metadata'!F$6,IF(B31='2. Metadata'!G$1,'2. Metadata'!G$6,IF(B31='2. Metadata'!H$1,'2. Metadata'!H$6, IF(B31='2. Metadata'!I$1,'2. Metadata'!I$6, IF(B31='2. Metadata'!J$1,'2. Metadata'!J$6, IF(B31='2. Metadata'!K$1,'2. Metadata'!K$6, IF(B31='2. Metadata'!L$1,'2. Metadata'!L$6, IF(B31='2. Metadata'!M$1,'2. Metadata'!M$6, IF(B31='2. Metadata'!N$1,'2. Metadata'!N$6))))))))))))))","v":-117.88417},"n/a",14.864,{"$f":"IF(ISBLANK(F31)=TRUE,\" \",'2. Metadata'!B$14)","v":"degrees Celsius"},11.273,{"$f":"IF(ISBLANK(H31)=TRUE,\" \",'2. Metadata'!B$26)","v":"degrees Celsius"},12.997,{"$f":"IF(ISBLANK(J31)=TRUE,\" \",'2. Metadata'!B$38)","v":"degrees Celsius"},"n/a"]
["2013-09-03","NECAR01",{"$f":"IF(ISBLANK(B32)=TRUE,\" \", IF(B32='2. Metadata'!B$1,'2. Metadata'!B$5, IF(B32='2. Metadata'!C$1,'2. Metadata'!C$5,IF(B32='2. Metadata'!D$1,'2. Metadata'!D$5, IF(B32='2. Metadata'!E$1,'2. Metadata'!E$5,IF( B32='2. Metadata'!F$1,'2. Metadata'!F$5,IF(B32='2. Metadata'!G$1,'2. Metadata'!G$5,IF(B32='2. Metadata'!H$1,'2. Metadata'!H$5, IF(B32='2. Metadata'!I$1,'2. Metadata'!I$5, IF(B32='2. Metadata'!J$1,'2. Metadata'!J$5, IF(B32='2. Metadata'!K$1,'2. Metadata'!K$5, IF(B32='2. Metadata'!L$1,'2. Metadata'!L$5, IF(B32='2. Metadata'!M$1,'2. Metadata'!M$5, IF(B32='2. Metadata'!N$1,'2. Metadata'!N$5))))))))))))))","v":49.97944},{"$f":"IF(ISBLANK(B32)=TRUE,\" \", IF(B32='2. Metadata'!B$1,'2. Metadata'!B$6, IF(B32='2. Metadata'!C$1,'2. Metadata'!C$6,IF(B32='2. Metadata'!D$1,'2. Metadata'!D$6, IF(B32='2. Metadata'!E$1,'2. Metadata'!E$6,IF( B32='2. Metadata'!F$1,'2. Metadata'!F$6,IF(B32='2. Metadata'!G$1,'2. Metadata'!G$6,IF(B32='2. Metadata'!H$1,'2. Metadata'!H$6, IF(B32='2. Metadata'!I$1,'2. Metadata'!I$6, IF(B32='2. Metadata'!J$1,'2. Metadata'!J$6, IF(B32='2. Metadata'!K$1,'2. Metadata'!K$6, IF(B32='2. Metadata'!L$1,'2. Metadata'!L$6, IF(B32='2. Metadata'!M$1,'2. Metadata'!M$6, IF(B32='2. Metadata'!N$1,'2. Metadata'!N$6))))))))))))))","v":-117.88417},"n/a",14.888,{"$f":"IF(ISBLANK(F32)=TRUE,\" \",'2. Metadata'!B$14)","v":"degrees Celsius"},12.219,{"$f":"IF(ISBLANK(H32)=TRUE,\" \",'2. Metadata'!B$26)","v":"degrees Celsius"},13.491,{"$f":"IF(ISBLANK(J32)=TRUE,\" \",'2. Metadata'!B$38)","v":"degrees Celsius"},"n/a"]
["2013-09-04","NECAR01",{"$f":"IF(ISBLANK(B33)=TRUE,\" \", IF(B33='2. Metadata'!B$1,'2. Metadata'!B$5, IF(B33='2. Metadata'!C$1,'2. Metadata'!C$5,IF(B33='2. Metadata'!D$1,'2. Metadata'!D$5, IF(B33='2. Metadata'!E$1,'2. Metadata'!E$5,IF( B33='2. Metadata'!F$1,'2. Metadata'!F$5,IF(B33='2. Metadata'!G$1,'2. Metadata'!G$5,IF(B33='2. Metadata'!H$1,'2. Metadata'!H$5, IF(B33='2. Metadata'!I$1,'2. Metadata'!I$5, IF(B33='2. Metadata'!J$1,'2. Metadata'!J$5, IF(B33='2. Metadata'!K$1,'2. Metadata'!K$5, IF(B33='2. Metadata'!L$1,'2. Metadata'!L$5, IF(B33='2. Metadata'!M$1,'2. Metadata'!M$5, IF(B33='2. Metadata'!N$1,'2. Metadata'!N$5))))))))))))))","v":49.97944},{"$f":"IF(ISBLANK(B33)=TRUE,\" \", IF(B33='2. Metadata'!B$1,'2. Metadata'!B$6, IF(B33='2. Metadata'!C$1,'2. Metadata'!C$6,IF(B33='2. Metadata'!D$1,'2. Metadata'!D$6, IF(B33='2. Metadata'!E$1,'2. Metadata'!E$6,IF( B33='2. Metadata'!F$1,'2. Metadata'!F$6,IF(B33='2. Metadata'!G$1,'2. Metadata'!G$6,IF(B33='2. Metadata'!H$1,'2. Metadata'!H$6, IF(B33='2. Metadata'!I$1,'2. Metadata'!I$6, IF(B33='2. Metadata'!J$1,'2. Metadata'!J$6, IF(B33='2. Metadata'!K$1,'2. Metadata'!K$6, IF(B33='2. Metadata'!L$1,'2. Metadata'!L$6, IF(B33='2. Metadata'!M$1,'2. Metadata'!M$6, IF(B33='2. Metadata'!N$1,'2. Metadata'!N$6))))))))))))))","v":-117.88417},"n/a",15.963,{"$f":"IF(ISBLANK(F33)=TRUE,\" \",'2. Metadata'!B$14)","v":"degrees Celsius"},12.437,{"$f":"IF(ISBLANK(H33)=TRUE,\" \",'2. Metadata'!B$26)","v":"degrees Celsius"},13.95,{"$f":"IF(ISBLANK(J33)=TRUE,\" \",'2. Metadata'!B$38)","v":"degrees Celsius"},"n/a"]
["2013-09-05","NECAR01",{"$f":"IF(ISBLANK(B34)=TRUE,\" \", IF(B34='2. Metadata'!B$1,'2. Metadata'!B$5, IF(B34='2. Metadata'!C$1,'2. Metadata'!C$5,IF(B34='2. Metadata'!D$1,'2. Metadata'!D$5, IF(B34='2. Metadata'!E$1,'2. Metadata'!E$5,IF( B34='2. Metadata'!F$1,'2. Metadata'!F$5,IF(B34='2. Metadata'!G$1,'2. Metadata'!G$5,IF(B34='2. Metadata'!H$1,'2. Metadata'!H$5, IF(B34='2. Metadata'!I$1,'2. Metadata'!I$5, IF(B34='2. Metadata'!J$1,'2. Metadata'!J$5, IF(B34='2. Metadata'!K$1,'2. Metadata'!K$5, IF(B34='2. Metadata'!L$1,'2. Metadata'!L$5, IF(B34='2. Metadata'!M$1,'2. Metadata'!M$5, IF(B34='2. Metadata'!N$1,'2. Metadata'!N$5))))))))))))))","v":49.97944},{"$f":"IF(ISBLANK(B34)=TRUE,\" \", IF(B34='2. Metadata'!B$1,'2. Metadata'!B$6, IF(B34='2. Metadata'!C$1,'2. Metadata'!C$6,IF(B34='2. Metadata'!D$1,'2. Metadata'!D$6, IF(B34='2. Metadata'!E$1,'2. Metadata'!E$6,IF( B34='2. Metadata'!F$1,'2. Metadata'!F$6,IF(B34='2. Metadata'!G$1,'2. Metadata'!G$6,IF(B34='2. Metadata'!H$1,'2. Metadata'!H$6, IF(B34='2. Metadata'!I$1,'2. Metadata'!I$6, IF(B34='2. Metadata'!J$1,'2. Metadata'!J$6, IF(B34='2. Metadata'!K$1,'2. Metadata'!K$6, IF(B34='2. Metadata'!L$1,'2. Metadata'!L$6, IF(B34='2. Metadata'!M$1,'2. Metadata'!M$6, IF(B34='2. Metadata'!N$1,'2. Metadata'!N$6))))))))))))))","v":-117.88417},"n/a",14.074,{"$f":"IF(ISBLANK(F34)=TRUE,\" \",'2. Metadata'!B$14)","v":"degrees Celsius"},12.775,{"$f":"IF(ISBLANK(H34)=TRUE,\" \",'2. Metadata'!B$26)","v":"degrees Celsius"},13.456,{"$f":"IF(ISBLANK(J34)=TRUE,\" \",'2. Metadata'!B$38)","v":"degrees Celsius"},"n/a"]
["2013-09-06","NECAR01",{"$f":"IF(ISBLANK(B35)=TRUE,\" \", IF(B35='2. Metadata'!B$1,'2. Metadata'!B$5, IF(B35='2. Metadata'!C$1,'2. Metadata'!C$5,IF(B35='2. Metadata'!D$1,'2. Metadata'!D$5, IF(B35='2. Metadata'!E$1,'2. Metadata'!E$5,IF( B35='2. Metadata'!F$1,'2. Metadata'!F$5,IF(B35='2. Metadata'!G$1,'2. Metadata'!G$5,IF(B35='2. Metadata'!H$1,'2. Metadata'!H$5, IF(B35='2. Metadata'!I$1,'2. Metadata'!I$5, IF(B35='2. Metadata'!J$1,'2. Metadata'!J$5, IF(B35='2. Metadata'!K$1,'2. Metadata'!K$5, IF(B35='2. Metadata'!L$1,'2. Metadata'!L$5, IF(B35='2. Metadata'!M$1,'2. Metadata'!M$5, IF(B35='2. Metadata'!N$1,'2. Metadata'!N$5))))))))))))))","v":49.97944},{"$f":"IF(ISBLANK(B35)=TRUE,\" \", IF(B35='2. Metadata'!B$1,'2. Metadata'!B$6, IF(B35='2. Metadata'!C$1,'2. Metadata'!C$6,IF(B35='2. Metadata'!D$1,'2. Metadata'!D$6, IF(B35='2. Metadata'!E$1,'2. Metadata'!E$6,IF( B35='2. Metadata'!F$1,'2. Metadata'!F$6,IF(B35='2. Metadata'!G$1,'2. Metadata'!G$6,IF(B35='2. Metadata'!H$1,'2. Metadata'!H$6, IF(B35='2. Metadata'!I$1,'2. Metadata'!I$6, IF(B35='2. Metadata'!J$1,'2. Metadata'!J$6, IF(B35='2. Metadata'!K$1,'2. Metadata'!K$6, IF(B35='2. Metadata'!L$1,'2. Metadata'!L$6, IF(B35='2. Metadata'!M$1,'2. Metadata'!M$6, IF(B35='2. Metadata'!N$1,'2. Metadata'!N$6))))))))))))))","v":-117.88417},"n/a",13.786,{"$f":"IF(ISBLANK(F35)=TRUE,\" \",'2. Metadata'!B$14)","v":"degrees Celsius"},12.364,{"$f":"IF(ISBLANK(H35)=TRUE,\" \",'2. Metadata'!B$26)","v":"degrees Celsius"},13.015,{"$f":"IF(ISBLANK(J35)=TRUE,\" \",'2. Metadata'!B$38)","v":"degrees Celsius"},"n/a"]
["2013-09-07","NECAR01",{"$f":"IF(ISBLANK(B36)=TRUE,\" \", IF(B36='2. Metadata'!B$1,'2. Metadata'!B$5, IF(B36='2. Metadata'!C$1,'2. Metadata'!C$5,IF(B36='2. Metadata'!D$1,'2. Metadata'!D$5, IF(B36='2. Metadata'!E$1,'2. Metadata'!E$5,IF( B36='2. Metadata'!F$1,'2. Metadata'!F$5,IF(B36='2. Metadata'!G$1,'2. Metadata'!G$5,IF(B36='2. Metadata'!H$1,'2. Metadata'!H$5, IF(B36='2. Metadata'!I$1,'2. Metadata'!I$5, IF(B36='2. Metadata'!J$1,'2. Metadata'!J$5, IF(B36='2. Metadata'!K$1,'2. Metadata'!K$5, IF(B36='2. Metadata'!L$1,'2. Metadata'!L$5, IF(B36='2. Metadata'!M$1,'2. Metadata'!M$5, IF(B36='2. Metadata'!N$1,'2. Metadata'!N$5))))))))))))))","v":49.97944},{"$f":"IF(ISBLANK(B36)=TRUE,\" \", IF(B36='2. Metadata'!B$1,'2. Metadata'!B$6, IF(B36='2. Metadata'!C$1,'2. Metadata'!C$6,IF(B36='2. Metadata'!D$1,'2. Metadata'!D$6, IF(B36='2. Metadata'!E$1,'2. Metadata'!E$6,IF( B36='2. Metadata'!F$1,'2. Metadata'!F$6,IF(B36='2. Metadata'!G$1,'2. Metadata'!G$6,IF(B36='2. Metadata'!H$1,'2. Metadata'!H$6, IF(B36='2. Metadata'!I$1,'2. Metadata'!I$6, IF(B36='2. Metadata'!J$1,'2. Metadata'!J$6, IF(B36='2. Metadata'!K$1,'2. Metadata'!K$6, IF(B36='2. Metadata'!L$1,'2. Metadata'!L$6, IF(B36='2. Metadata'!M$1,'2. Metadata'!M$6, IF(B36='2. Metadata'!N$1,'2. Metadata'!N$6))))))))))))))","v":-117.88417},"n/a",12.992,{"$f":"IF(ISBLANK(F36)=TRUE,\" \",'2. Metadata'!B$14)","v":"degrees Celsius"},11.929,{"$f":"IF(ISBLANK(H36)=TRUE,\" \",'2. Metadata'!B$26)","v":"degrees Celsius"},12.406,{"$f":"IF(ISBLANK(J36)=TRUE,\" \",'2. Metadata'!B$38)","v":"degrees Celsius"},"n/a"]
["2013-09-08","NECAR01",{"$f":"IF(ISBLANK(B37)=TRUE,\" \", IF(B37='2. Metadata'!B$1,'2. Metadata'!B$5, IF(B37='2. Metadata'!C$1,'2. Metadata'!C$5,IF(B37='2. Metadata'!D$1,'2. Metadata'!D$5, IF(B37='2. Metadata'!E$1,'2. Metadata'!E$5,IF( B37='2. Metadata'!F$1,'2. Metadata'!F$5,IF(B37='2. Metadata'!G$1,'2. Metadata'!G$5,IF(B37='2. Metadata'!H$1,'2. Metadata'!H$5, IF(B37='2. Metadata'!I$1,'2. Metadata'!I$5, IF(B37='2. Metadata'!J$1,'2. Metadata'!J$5, IF(B37='2. Metadata'!K$1,'2. Metadata'!K$5, IF(B37='2. Metadata'!L$1,'2. Metadata'!L$5, IF(B37='2. Metadata'!M$1,'2. Metadata'!M$5, IF(B37='2. Metadata'!N$1,'2. Metadata'!N$5))))))))))))))","v":49.97944},{"$f":"IF(ISBLANK(B37)=TRUE,\" \", IF(B37='2. Metadata'!B$1,'2. Metadata'!B$6, IF(B37='2. Metadata'!C$1,'2. Metadata'!C$6,IF(B37='2. Metadata'!D$1,'2. Metadata'!D$6, IF(B37='2. Metadata'!E$1,'2. Metadata'!E$6,IF( B37='2. Metadata'!F$1,'2. Metadata'!F$6,IF(B37='2. Metadata'!G$1,'2. Metadata'!G$6,IF(B37='2. Metadata'!H$1,'2. Metadata'!H$6, IF(B37='2. Metadata'!I$1,'2. Metadata'!I$6, IF(B37='2. Metadata'!J$1,'2. Metadata'!J$6, IF(B37='2. Metadata'!K$1,'2. Metadata'!K$6, IF(B37='2. Metadata'!L$1,'2. Metadata'!L$6, IF(B37='2. Metadata'!M$1,'2. Metadata'!M$6, IF(B37='2. Metadata'!N$1,'2. Metadata'!N$6))))))))))))))","v":-117.88417},"n/a",13.425,{"$f":"IF(ISBLANK(F37)=TRUE,\" \",'2. Metadata'!B$14)","v":"degrees Celsius"},11.977,{"$f":"IF(ISBLANK(H37)=TRUE,\" \",'2. Metadata'!B$26)","v":"degrees Celsius"},12.527,{"$f":"IF(ISBLANK(J37)=TRUE,\" \",'2. Metadata'!B$38)","v":"degrees Celsius"},"n/a"]
["2013-09-09","NECAR01",{"$f":"IF(ISBLANK(B38)=TRUE,\" \", IF(B38='2. Metadata'!B$1,'2. Metadata'!B$5, IF(B38='2. Metadata'!C$1,'2. Metadata'!C$5,IF(B38='2. Metadata'!D$1,'2. Metadata'!D$5, IF(B38='2. Metadata'!E$1,'2. Metadata'!E$5,IF( B38='2. Metadata'!F$1,'2. Metadata'!F$5,IF(B38='2. Metadata'!G$1,'2. Metadata'!G$5,IF(B38='2. Metadata'!H$1,'2. Metadata'!H$5, IF(B38='2. Metadata'!I$1,'2. Metadata'!I$5, IF(B38='2. Metadata'!J$1,'2. Metadata'!J$5, IF(B38='2. Metadata'!K$1,'2. Metadata'!K$5, IF(B38='2. Metadata'!L$1,'2. Metadata'!L$5, IF(B38='2. Metadata'!M$1,'2. Metadata'!M$5, IF(B38='2. Metadata'!N$1,'2. Metadata'!N$5))))))))))))))","v":49.97944},{"$f":"IF(ISBLANK(B38)=TRUE,\" \", IF(B38='2. Metadata'!B$1,'2. Metadata'!B$6, IF(B38='2. Metadata'!C$1,'2. Metadata'!C$6,IF(B38='2. Metadata'!D$1,'2. Metadata'!D$6, IF(B38='2. Metadata'!E$1,'2. Metadata'!E$6,IF( B38='2. Metadata'!F$1,'2. Metadata'!F$6,IF(B38='2. Metadata'!G$1,'2. Metadata'!G$6,IF(B38='2. Metadata'!H$1,'2. Metadata'!H$6, IF(B38='2. Metadata'!I$1,'2. Metadata'!I$6, IF(B38='2. Metadata'!J$1,'2. Metadata'!J$6, IF(B38='2. Metadata'!K$1,'2. Metadata'!K$6, IF(B38='2. Metadata'!L$1,'2. Metadata'!L$6, IF(B38='2. Metadata'!M$1,'2. Metadata'!M$6, IF(B38='2. Metadata'!N$1,'2. Metadata'!N$6))))))))))))))","v":-117.88417},"n/a",14.649,{"$f":"IF(ISBLANK(F38)=TRUE,\" \",'2. Metadata'!B$14)","v":"degrees Celsius"},11.637,{"$f":"IF(ISBLANK(H38)=TRUE,\" \",'2. Metadata'!B$26)","v":"degrees Celsius"},12.904,{"$f":"IF(ISBLANK(J38)=TRUE,\" \",'2. Metadata'!B$38)","v":"degrees Celsius"},"n/a"]
["2013-09-10","NECAR01",{"$f":"IF(ISBLANK(B39)=TRUE,\" \", IF(B39='2. Metadata'!B$1,'2. Metadata'!B$5, IF(B39='2. Metadata'!C$1,'2. Metadata'!C$5,IF(B39='2. Metadata'!D$1,'2. Metadata'!D$5, IF(B39='2. Metadata'!E$1,'2. Metadata'!E$5,IF( B39='2. Metadata'!F$1,'2. Metadata'!F$5,IF(B39='2. Metadata'!G$1,'2. Metadata'!G$5,IF(B39='2. Metadata'!H$1,'2. Metadata'!H$5, IF(B39='2. Metadata'!I$1,'2. Metadata'!I$5, IF(B39='2. Metadata'!J$1,'2. Metadata'!J$5, IF(B39='2. Metadata'!K$1,'2. Metadata'!K$5, IF(B39='2. Metadata'!L$1,'2. Metadata'!L$5, IF(B39='2. Metadata'!M$1,'2. Metadata'!M$5, IF(B39='2. Metadata'!N$1,'2. Metadata'!N$5))))))))))))))","v":49.97944},{"$f":"IF(ISBLANK(B39)=TRUE,\" \", IF(B39='2. Metadata'!B$1,'2. Metadata'!B$6, IF(B39='2. Metadata'!C$1,'2. Metadata'!C$6,IF(B39='2. Metadata'!D$1,'2. Metadata'!D$6, IF(B39='2. Metadata'!E$1,'2. Metadata'!E$6,IF( B39='2. Metadata'!F$1,'2. Metadata'!F$6,IF(B39='2. Metadata'!G$1,'2. Metadata'!G$6,IF(B39='2. Metadata'!H$1,'2. Metadata'!H$6, IF(B39='2. Metadata'!I$1,'2. Metadata'!I$6, IF(B39='2. Metadata'!J$1,'2. Metadata'!J$6, IF(B39='2. Metadata'!K$1,'2. Metadata'!K$6, IF(B39='2. Metadata'!L$1,'2. Metadata'!L$6, IF(B39='2. Metadata'!M$1,'2. Metadata'!M$6, IF(B39='2. Metadata'!N$1,'2. Metadata'!N$6))))))))))))))","v":-117.88417},"n/a",14.84,{"$f":"IF(ISBLANK(F39)=TRUE,\" \",'2. Metadata'!B$14)","v":"degrees Celsius"},11.686,{"$f":"IF(ISBLANK(H39)=TRUE,\" \",'2. Metadata'!B$26)","v":"degrees Celsius"},13.049,{"$f":"IF(ISBLANK(J39)=TRUE,\" \",'2. Metadata'!B$38)","v":"degrees Celsius"},"n/a"]
["2013-09-11","NECAR01",{"$f":"IF(ISBLANK(B40)=TRUE,\" \", IF(B40='2. Metadata'!B$1,'2. Metadata'!B$5, IF(B40='2. Metadata'!C$1,'2. Metadata'!C$5,IF(B40='2. Metadata'!D$1,'2. Metadata'!D$5, IF(B40='2. Metadata'!E$1,'2. Metadata'!E$5,IF( B40='2. Metadata'!F$1,'2. Metadata'!F$5,IF(B40='2. Metadata'!G$1,'2. Metadata'!G$5,IF(B40='2. Metadata'!H$1,'2. Metadata'!H$5, IF(B40='2. Metadata'!I$1,'2. Metadata'!I$5, IF(B40='2. Metadata'!J$1,'2. Metadata'!J$5, IF(B40='2. Metadata'!K$1,'2. Metadata'!K$5, IF(B40='2. Metadata'!L$1,'2. Metadata'!L$5, IF(B40='2. Metadata'!M$1,'2. Metadata'!M$5, IF(B40='2. Metadata'!N$1,'2. Metadata'!N$5))))))))))))))","v":49.97944},{"$f":"IF(ISBLANK(B40)=TRUE,\" \", IF(B40='2. Metadata'!B$1,'2. Metadata'!B$6, IF(B40='2. Metadata'!C$1,'2. Metadata'!C$6,IF(B40='2. Metadata'!D$1,'2. Metadata'!D$6, IF(B40='2. Metadata'!E$1,'2. Metadata'!E$6,IF( B40='2. Metadata'!F$1,'2. Metadata'!F$6,IF(B40='2. Metadata'!G$1,'2. Metadata'!G$6,IF(B40='2. Metadata'!H$1,'2. Metadata'!H$6, IF(B40='2. Metadata'!I$1,'2. Metadata'!I$6, IF(B40='2. Metadata'!J$1,'2. Metadata'!J$6, IF(B40='2. Metadata'!K$1,'2. Metadata'!K$6, IF(B40='2. Metadata'!L$1,'2. Metadata'!L$6, IF(B40='2. Metadata'!M$1,'2. Metadata'!M$6, IF(B40='2. Metadata'!N$1,'2. Metadata'!N$6))))))))))))))","v":-117.88417},"n/a",14.625,{"$f":"IF(ISBLANK(F40)=TRUE,\" \",'2. Metadata'!B$14)","v":"degrees Celsius"},11.419,{"$f":"IF(ISBLANK(H40)=TRUE,\" \",'2. Metadata'!B$26)","v":"degrees Celsius"},12.88,{"$f":"IF(ISBLANK(J40)=TRUE,\" \",'2. Metadata'!B$38)","v":"degrees Celsius"},"n/a"]
["2013-09-12","NECAR01",{"$f":"IF(ISBLANK(B41)=TRUE,\" \", IF(B41='2. Metadata'!B$1,'2. Metadata'!B$5, IF(B41='2. Metadata'!C$1,'2. Metadata'!C$5,IF(B41='2. Metadata'!D$1,'2. Metadata'!D$5, IF(B41='2. Metadata'!E$1,'2. Metadata'!E$5,IF( B41='2. Metadata'!F$1,'2. Metadata'!F$5,IF(B41='2. Metadata'!G$1,'2. Metadata'!G$5,IF(B41='2. Metadata'!H$1,'2. Metadata'!H$5, IF(B41='2. Metadata'!I$1,'2. Metadata'!I$5, IF(B41='2. Metadata'!J$1,'2. Metadata'!J$5, IF(B41='2. Metadata'!K$1,'2. Metadata'!K$5, IF(B41='2. Metadata'!L$1,'2. Metadata'!L$5, IF(B41='2. Metadata'!M$1,'2. Metadata'!M$5, IF(B41='2. Metadata'!N$1,'2. Metadata'!N$5))))))))))))))","v":49.97944},{"$f":"IF(ISBLANK(B41)=TRUE,\" \", IF(B41='2. Metadata'!B$1,'2. Metadata'!B$6, IF(B41='2. Metadata'!C$1,'2. Metadata'!C$6,IF(B41='2. Metadata'!D$1,'2. Metadata'!D$6, IF(B41='2. Metadata'!E$1,'2. Metadata'!E$6,IF( B41='2. Metadata'!F$1,'2. Metadata'!F$6,IF(B41='2. Metadata'!G$1,'2. Metadata'!G$6,IF(B41='2. Metadata'!H$1,'2. Metadata'!H$6, IF(B41='2. Metadata'!I$1,'2. Metadata'!I$6, IF(B41='2. Metadata'!J$1,'2. Metadata'!J$6, IF(B41='2. Metadata'!K$1,'2. Metadata'!K$6, IF(B41='2. Metadata'!L$1,'2. Metadata'!L$6, IF(B41='2. Metadata'!M$1,'2. Metadata'!M$6, IF(B41='2. Metadata'!N$1,'2. Metadata'!N$6))))))))))))))","v":-117.88417},"n/a",15.031,{"$f":"IF(ISBLANK(F41)=TRUE,\" \",'2. Metadata'!B$14)","v":"degrees Celsius"},11.662,{"$f":"IF(ISBLANK(H41)=TRUE,\" \",'2. Metadata'!B$26)","v":"degrees Celsius"},13.158,{"$f":"IF(ISBLANK(J41)=TRUE,\" \",'2. Metadata'!B$38)","v":"degrees Celsius"},"n/a"]
["2013-09-13","NECAR01",{"$f":"IF(ISBLANK(B42)=TRUE,\" \", IF(B42='2. Metadata'!B$1,'2. Metadata'!B$5, IF(B42='2. Metadata'!C$1,'2. Metadata'!C$5,IF(B42='2. Metadata'!D$1,'2. Metadata'!D$5, IF(B42='2. Metadata'!E$1,'2. Metadata'!E$5,IF( B42='2. Metadata'!F$1,'2. Metadata'!F$5,IF(B42='2. Metadata'!G$1,'2. Metadata'!G$5,IF(B42='2. Metadata'!H$1,'2. Metadata'!H$5, IF(B42='2. Metadata'!I$1,'2. Metadata'!I$5, IF(B42='2. Metadata'!J$1,'2. Metadata'!J$5, IF(B42='2. Metadata'!K$1,'2. Metadata'!K$5, IF(B42='2. Metadata'!L$1,'2. Metadata'!L$5, IF(B42='2. Metadata'!M$1,'2. Metadata'!M$5, IF(B42='2. Metadata'!N$1,'2. Metadata'!N$5))))))))))))))","v":49.97944},{"$f":"IF(ISBLANK(B42)=TRUE,\" \", IF(B42='2. Metadata'!B$1,'2. Metadata'!B$6, IF(B42='2. Metadata'!C$1,'2. Metadata'!C$6,IF(B42='2. Metadata'!D$1,'2. Metadata'!D$6, IF(B42='2. Metadata'!E$1,'2. Metadata'!E$6,IF( B42='2. Metadata'!F$1,'2. Metadata'!F$6,IF(B42='2. Metadata'!G$1,'2. Metadata'!G$6,IF(B42='2. Metadata'!H$1,'2. Metadata'!H$6, IF(B42='2. Metadata'!I$1,'2. Metadata'!I$6, IF(B42='2. Metadata'!J$1,'2. Metadata'!J$6, IF(B42='2. Metadata'!K$1,'2. Metadata'!K$6, IF(B42='2. Metadata'!L$1,'2. Metadata'!L$6, IF(B42='2. Metadata'!M$1,'2. Metadata'!M$6, IF(B42='2. Metadata'!N$1,'2. Metadata'!N$6))))))))))))))","v":-117.88417},"n/a",15.223,{"$f":"IF(ISBLANK(F42)=TRUE,\" \",'2. Metadata'!B$14)","v":"degrees Celsius"},11.856,{"$f":"IF(ISBLANK(H42)=TRUE,\" \",'2. Metadata'!B$26)","v":"degrees Celsius"},13.365,{"$f":"IF(ISBLANK(J42)=TRUE,\" \",'2. Metadata'!B$38)","v":"degrees Celsius"},"n/a"]
["2013-09-14","NECAR01",{"$f":"IF(ISBLANK(B43)=TRUE,\" \", IF(B43='2. Metadata'!B$1,'2. Metadata'!B$5, IF(B43='2. Metadata'!C$1,'2. Metadata'!C$5,IF(B43='2. Metadata'!D$1,'2. Metadata'!D$5, IF(B43='2. Metadata'!E$1,'2. Metadata'!E$5,IF( B43='2. Metadata'!F$1,'2. Metadata'!F$5,IF(B43='2. Metadata'!G$1,'2. Metadata'!G$5,IF(B43='2. Metadata'!H$1,'2. Metadata'!H$5, IF(B43='2. Metadata'!I$1,'2. Metadata'!I$5, IF(B43='2. Metadata'!J$1,'2. Metadata'!J$5, IF(B43='2. Metadata'!K$1,'2. Metadata'!K$5, IF(B43='2. Metadata'!L$1,'2. Metadata'!L$5, IF(B43='2. Metadata'!M$1,'2. Metadata'!M$5, IF(B43='2. Metadata'!N$1,'2. Metadata'!N$5))))))))))))))","v":49.97944},{"$f":"IF(ISBLANK(B43)=TRUE,\" \", IF(B43='2. Metadata'!B$1,'2. Metadata'!B$6, IF(B43='2. Metadata'!C$1,'2. Metadata'!C$6,IF(B43='2. Metadata'!D$1,'2. Metadata'!D$6, IF(B43='2. Metadata'!E$1,'2. Metadata'!E$6,IF( B43='2. Metadata'!F$1,'2. Metadata'!F$6,IF(B43='2. Metadata'!G$1,'2. Metadata'!G$6,IF(B43='2. Metadata'!H$1,'2. Metadata'!H$6, IF(B43='2. Metadata'!I$1,'2. Metadata'!I$6, IF(B43='2. Metadata'!J$1,'2. Metadata'!J$6, IF(B43='2. Metadata'!K$1,'2. Metadata'!K$6, IF(B43='2. Metadata'!L$1,'2. Metadata'!L$6, IF(B43='2. Metadata'!M$1,'2. Metadata'!M$6, IF(B43='2. Metadata'!N$1,'2. Metadata'!N$6))))))))))))))","v":-117.88417},"n/a",15.008,{"$f":"IF(ISBLANK(F43)=TRUE,\" \",'2. Metadata'!B$14)","v":"degrees Celsius"},11.953,{"$f":"IF(ISBLANK(H43)=TRUE,\" \",'2. Metadata'!B$26)","v":"degrees Celsius"},13.376,{"$f":"IF(ISBLANK(J43)=TRUE,\" \",'2. Metadata'!B$38)","v":"degrees Celsius"},"n/a"]
["2013-09-15","NECAR01",{"$f":"IF(ISBLANK(B44)=TRUE,\" \", IF(B44='2. Metadata'!B$1,'2. Metadata'!B$5, IF(B44='2. Metadata'!C$1,'2. Metadata'!C$5,IF(B44='2. Metadata'!D$1,'2. Metadata'!D$5, IF(B44='2. Metadata'!E$1,'2. Metadata'!E$5,IF( B44='2. Metadata'!F$1,'2. Metadata'!F$5,IF(B44='2. Metadata'!G$1,'2. Metadata'!G$5,IF(B44='2. Metadata'!H$1,'2. Metadata'!H$5, IF(B44='2. Metadata'!I$1,'2. Metadata'!I$5, IF(B44='2. Metadata'!J$1,'2. Metadata'!J$5, IF(B44='2. Metadata'!K$1,'2. Metadata'!K$5, IF(B44='2. Metadata'!L$1,'2. Metadata'!L$5, IF(B44='2. Metadata'!M$1,'2. Metadata'!M$5, IF(B44='2. Metadata'!N$1,'2. Metadata'!N$5))))))))))))))","v":49.97944},{"$f":"IF(ISBLANK(B44)=TRUE,\" \", IF(B44='2. Metadata'!B$1,'2. Metadata'!B$6, IF(B44='2. Metadata'!C$1,'2. Metadata'!C$6,IF(B44='2. Metadata'!D$1,'2. Metadata'!D$6, IF(B44='2. Metadata'!E$1,'2. Metadata'!E$6,IF( B44='2. Metadata'!F$1,'2. Metadata'!F$6,IF(B44='2. Metadata'!G$1,'2. Metadata'!G$6,IF(B44='2. Metadata'!H$1,'2. Metadata'!H$6, IF(B44='2. Metadata'!I$1,'2. Metadata'!I$6, IF(B44='2. Metadata'!J$1,'2. Metadata'!J$6, IF(B44='2. Metadata'!K$1,'2. Metadata'!K$6, IF(B44='2. Metadata'!L$1,'2. Metadata'!L$6, IF(B44='2. Metadata'!M$1,'2. Metadata'!M$6, IF(B44='2. Metadata'!N$1,'2. Metadata'!N$6))))))))))))))","v":-117.88417},"n/a",15.031,{"$f":"IF(ISBLANK(F44)=TRUE,\" \",'2. Metadata'!B$14)","v":"degrees Celsius"},12.147,{"$f":"IF(ISBLANK(H44)=TRUE,\" \",'2. Metadata'!B$26)","v":"degrees Celsius"},13.484,{"$f":"IF(ISBLANK(J44)=TRUE,\" \",'2. Metadata'!B$38)","v":"degrees Celsius"},"n/a"]
["2013-09-16","NECAR01",{"$f":"IF(ISBLANK(B45)=TRUE,\" \", IF(B45='2. Metadata'!B$1,'2. Metadata'!B$5, IF(B45='2. Metadata'!C$1,'2. Metadata'!C$5,IF(B45='2. Metadata'!D$1,'2. Metadata'!D$5, IF(B45='2. Metadata'!E$1,'2. Metadata'!E$5,IF( B45='2. Metadata'!F$1,'2. Metadata'!F$5,IF(B45='2. Metadata'!G$1,'2. Metadata'!G$5,IF(B45='2. Metadata'!H$1,'2. Metadata'!H$5, IF(B45='2. Metadata'!I$1,'2. Metadata'!I$5, IF(B45='2. Metadata'!J$1,'2. Metadata'!J$5, IF(B45='2. Metadata'!K$1,'2. Metadata'!K$5, IF(B45='2. Metadata'!L$1,'2. Metadata'!L$5, IF(B45='2. Metadata'!M$1,'2. Metadata'!M$5, IF(B45='2. Metadata'!N$1,'2. Metadata'!N$5))))))))))))))","v":49.97944},{"$f":"IF(ISBLANK(B45)=TRUE,\" \", IF(B45='2. Metadata'!B$1,'2. Metadata'!B$6, IF(B45='2. Metadata'!C$1,'2. Metadata'!C$6,IF(B45='2. Metadata'!D$1,'2. Metadata'!D$6, IF(B45='2. Metadata'!E$1,'2. Metadata'!E$6,IF( B45='2. Metadata'!F$1,'2. Metadata'!F$6,IF(B45='2. Metadata'!G$1,'2. Metadata'!G$6,IF(B45='2. Metadata'!H$1,'2. Metadata'!H$6, IF(B45='2. Metadata'!I$1,'2. Metadata'!I$6, IF(B45='2. Metadata'!J$1,'2. Metadata'!J$6, IF(B45='2. Metadata'!K$1,'2. Metadata'!K$6, IF(B45='2. Metadata'!L$1,'2. Metadata'!L$6, IF(B45='2. Metadata'!M$1,'2. Metadata'!M$6, IF(B45='2. Metadata'!N$1,'2. Metadata'!N$6))))))))))))))","v":-117.88417},"n/a",14.768,{"$f":"IF(ISBLANK(F45)=TRUE,\" \",'2. Metadata'!B$14)","v":"degrees Celsius"},12.968,{"$f":"IF(ISBLANK(H45)=TRUE,\" \",'2. Metadata'!B$26)","v":"degrees Celsius"},13.633,{"$f":"IF(ISBLANK(J45)=TRUE,\" \",'2. Metadata'!B$38)","v":"degrees Celsius"},"n/a"]
["2013-09-17","NECAR01",{"$f":"IF(ISBLANK(B46)=TRUE,\" \", IF(B46='2. Metadata'!B$1,'2. Metadata'!B$5, IF(B46='2. Metadata'!C$1,'2. Metadata'!C$5,IF(B46='2. Metadata'!D$1,'2. Metadata'!D$5, IF(B46='2. Metadata'!E$1,'2. Metadata'!E$5,IF( B46='2. Metadata'!F$1,'2. Metadata'!F$5,IF(B46='2. Metadata'!G$1,'2. Metadata'!G$5,IF(B46='2. Metadata'!H$1,'2. Metadata'!H$5, IF(B46='2. Metadata'!I$1,'2. Metadata'!I$5, IF(B46='2. Metadata'!J$1,'2. Metadata'!J$5, IF(B46='2. Metadata'!K$1,'2. Metadata'!K$5, IF(B46='2. Metadata'!L$1,'2. Metadata'!L$5, IF(B46='2. Metadata'!M$1,'2. Metadata'!M$5, IF(B46='2. Metadata'!N$1,'2. Metadata'!N$5))))))))))))))","v":49.97944},{"$f":"IF(ISBLANK(B46)=TRUE,\" \", IF(B46='2. Metadata'!B$1,'2. Metadata'!B$6, IF(B46='2. Metadata'!C$1,'2. Metadata'!C$6,IF(B46='2. Metadata'!D$1,'2. Metadata'!D$6, IF(B46='2. Metadata'!E$1,'2. Metadata'!E$6,IF( B46='2. Metadata'!F$1,'2. Metadata'!F$6,IF(B46='2. Metadata'!G$1,'2. Metadata'!G$6,IF(B46='2. Metadata'!H$1,'2. Metadata'!H$6, IF(B46='2. Metadata'!I$1,'2. Metadata'!I$6, IF(B46='2. Metadata'!J$1,'2. Metadata'!J$6, IF(B46='2. Metadata'!K$1,'2. Metadata'!K$6, IF(B46='2. Metadata'!L$1,'2. Metadata'!L$6, IF(B46='2. Metadata'!M$1,'2. Metadata'!M$6, IF(B46='2. Metadata'!N$1,'2. Metadata'!N$6))))))))))))))","v":-117.88417},"n/a",14.122,{"$f":"IF(ISBLANK(F46)=TRUE,\" \",'2. Metadata'!B$14)","v":"degrees Celsius"},11.832,{"$f":"IF(ISBLANK(H46)=TRUE,\" \",'2. Metadata'!B$26)","v":"degrees Celsius"},12.911,{"$f":"IF(ISBLANK(J46)=TRUE,\" \",'2. Metadata'!B$38)","v":"degrees Celsius"},"n/a"]
["2013-09-18","NECAR01",{"$f":"IF(ISBLANK(B47)=TRUE,\" \", IF(B47='2. Metadata'!B$1,'2. Metadata'!B$5, IF(B47='2. Metadata'!C$1,'2. Metadata'!C$5,IF(B47='2. Metadata'!D$1,'2. Metadata'!D$5, IF(B47='2. Metadata'!E$1,'2. Metadata'!E$5,IF( B47='2. Metadata'!F$1,'2. Metadata'!F$5,IF(B47='2. Metadata'!G$1,'2. Metadata'!G$5,IF(B47='2. Metadata'!H$1,'2. Metadata'!H$5, IF(B47='2. Metadata'!I$1,'2. Metadata'!I$5, IF(B47='2. Metadata'!J$1,'2. Metadata'!J$5, IF(B47='2. Metadata'!K$1,'2. Metadata'!K$5, IF(B47='2. Metadata'!L$1,'2. Metadata'!L$5, IF(B47='2. Metadata'!M$1,'2. Metadata'!M$5, IF(B47='2. Metadata'!N$1,'2. Metadata'!N$5))))))))))))))","v":49.97944},{"$f":"IF(ISBLANK(B47)=TRUE,\" \", IF(B47='2. Metadata'!B$1,'2. Metadata'!B$6, IF(B47='2. Metadata'!C$1,'2. Metadata'!C$6,IF(B47='2. Metadata'!D$1,'2. Metadata'!D$6, IF(B47='2. Metadata'!E$1,'2. Metadata'!E$6,IF( B47='2. Metadata'!F$1,'2. Metadata'!F$6,IF(B47='2. Metadata'!G$1,'2. Metadata'!G$6,IF(B47='2. Metadata'!H$1,'2. Metadata'!H$6, IF(B47='2. Metadata'!I$1,'2. Metadata'!I$6, IF(B47='2. Metadata'!J$1,'2. Metadata'!J$6, IF(B47='2. Metadata'!K$1,'2. Metadata'!K$6, IF(B47='2. Metadata'!L$1,'2. Metadata'!L$6, IF(B47='2. Metadata'!M$1,'2. Metadata'!M$6, IF(B47='2. Metadata'!N$1,'2. Metadata'!N$6))))))))))))))","v":-117.88417},"n/a",13.281,{"$f":"IF(ISBLANK(F47)=TRUE,\" \",'2. Metadata'!B$14)","v":"degrees Celsius"},11.248,{"$f":"IF(ISBLANK(H47)=TRUE,\" \",'2. Metadata'!B$26)","v":"degrees Celsius"},12.216,{"$f":"IF(ISBLANK(J47)=TRUE,\" \",'2. Metadata'!B$38)","v":"degrees Celsius"},"n/a"]
["2013-09-19","NECAR01",{"$f":"IF(ISBLANK(B48)=TRUE,\" \", IF(B48='2. Metadata'!B$1,'2. Metadata'!B$5, IF(B48='2. Metadata'!C$1,'2. Metadata'!C$5,IF(B48='2. Metadata'!D$1,'2. Metadata'!D$5, IF(B48='2. Metadata'!E$1,'2. Metadata'!E$5,IF( B48='2. Metadata'!F$1,'2. Metadata'!F$5,IF(B48='2. Metadata'!G$1,'2. Metadata'!G$5,IF(B48='2. Metadata'!H$1,'2. Metadata'!H$5, IF(B48='2. Metadata'!I$1,'2. Metadata'!I$5, IF(B48='2. Metadata'!J$1,'2. Metadata'!J$5, IF(B48='2. Metadata'!K$1,'2. Metadata'!K$5, IF(B48='2. Metadata'!L$1,'2. Metadata'!L$5, IF(B48='2. Metadata'!M$1,'2. Metadata'!M$5, IF(B48='2. Metadata'!N$1,'2. Metadata'!N$5))))))))))))))","v":49.97944},{"$f":"IF(ISBLANK(B48)=TRUE,\" \", IF(B48='2. Metadata'!B$1,'2. Metadata'!B$6, IF(B48='2. Metadata'!C$1,'2. Metadata'!C$6,IF(B48='2. Metadata'!D$1,'2. Metadata'!D$6, IF(B48='2. Metadata'!E$1,'2. Metadata'!E$6,IF( B48='2. Metadata'!F$1,'2. Metadata'!F$6,IF(B48='2. Metadata'!G$1,'2. Metadata'!G$6,IF(B48='2. Metadata'!H$1,'2. Metadata'!H$6, IF(B48='2. Metadata'!I$1,'2. Metadata'!I$6, IF(B48='2. Metadata'!J$1,'2. Metadata'!J$6, IF(B48='2. Metadata'!K$1,'2. Metadata'!K$6, IF(B48='2. Metadata'!L$1,'2. Metadata'!L$6, IF(B48='2. Metadata'!M$1,'2. Metadata'!M$6, IF(B48='2. Metadata'!N$1,'2. Metadata'!N$6))))))))))))))","v":-117.88417},"n/a",11.977,{"$f":"IF(ISBLANK(F48)=TRUE,\" \",'2. Metadata'!B$14)","v":"degrees Celsius"},9.485,{"$f":"IF(ISBLANK(H48)=TRUE,\" \",'2. Metadata'!B$26)","v":"degrees Celsius"},10.738,{"$f":"IF(ISBLANK(J48)=TRUE,\" \",'2. Metadata'!B$38)","v":"degrees Celsius"},"n/a"]
["2013-09-20","NECAR01",{"$f":"IF(ISBLANK(B49)=TRUE,\" \", IF(B49='2. Metadata'!B$1,'2. Metadata'!B$5, IF(B49='2. Metadata'!C$1,'2. Metadata'!C$5,IF(B49='2. Metadata'!D$1,'2. Metadata'!D$5, IF(B49='2. Metadata'!E$1,'2. Metadata'!E$5,IF( B49='2. Metadata'!F$1,'2. Metadata'!F$5,IF(B49='2. Metadata'!G$1,'2. Metadata'!G$5,IF(B49='2. Metadata'!H$1,'2. Metadata'!H$5, IF(B49='2. Metadata'!I$1,'2. Metadata'!I$5, IF(B49='2. Metadata'!J$1,'2. Metadata'!J$5, IF(B49='2. Metadata'!K$1,'2. Metadata'!K$5, IF(B49='2. Metadata'!L$1,'2. Metadata'!L$5, IF(B49='2. Metadata'!M$1,'2. Metadata'!M$5, IF(B49='2. Metadata'!N$1,'2. Metadata'!N$5))))))))))))))","v":49.97944},{"$f":"IF(ISBLANK(B49)=TRUE,\" \", IF(B49='2. Metadata'!B$1,'2. Metadata'!B$6, IF(B49='2. Metadata'!C$1,'2. Metadata'!C$6,IF(B49='2. Metadata'!D$1,'2. Metadata'!D$6, IF(B49='2. Metadata'!E$1,'2. Metadata'!E$6,IF( B49='2. Metadata'!F$1,'2. Metadata'!F$6,IF(B49='2. Metadata'!G$1,'2. Metadata'!G$6,IF(B49='2. Metadata'!H$1,'2. Metadata'!H$6, IF(B49='2. Metadata'!I$1,'2. Metadata'!I$6, IF(B49='2. Metadata'!J$1,'2. Metadata'!J$6, IF(B49='2. Metadata'!K$1,'2. Metadata'!K$6, IF(B49='2. Metadata'!L$1,'2. Metadata'!L$6, IF(B49='2. Metadata'!M$1,'2. Metadata'!M$6, IF(B49='2. Metadata'!N$1,'2. Metadata'!N$6))))))))))))))","v":-117.88417},"n/a",11.71,{"$f":"IF(ISBLANK(F49)=TRUE,\" \",'2. Metadata'!B$14)","v":"degrees Celsius"},8.965,{"$f":"IF(ISBLANK(H49)=TRUE,\" \",'2. Metadata'!B$26)","v":"degrees Celsius"},10.263,{"$f":"IF(ISBLANK(J49)=TRUE,\" \",'2. Metadata'!B$38)","v":"degrees Celsius"},"n/a"]
["2013-09-21","NECAR01",{"$f":"IF(ISBLANK(B50)=TRUE,\" \", IF(B50='2. Metadata'!B$1,'2. Metadata'!B$5, IF(B50='2. Metadata'!C$1,'2. Metadata'!C$5,IF(B50='2. Metadata'!D$1,'2. Metadata'!D$5, IF(B50='2. Metadata'!E$1,'2. Metadata'!E$5,IF( B50='2. Metadata'!F$1,'2. Metadata'!F$5,IF(B50='2. Metadata'!G$1,'2. Metadata'!G$5,IF(B50='2. Metadata'!H$1,'2. Metadata'!H$5, IF(B50='2. Metadata'!I$1,'2. Metadata'!I$5, IF(B50='2. Metadata'!J$1,'2. Metadata'!J$5, IF(B50='2. Metadata'!K$1,'2. Metadata'!K$5, IF(B50='2. Metadata'!L$1,'2. Metadata'!L$5, IF(B50='2. Metadata'!M$1,'2. Metadata'!M$5, IF(B50='2. Metadata'!N$1,'2. Metadata'!N$5))))))))))))))","v":49.97944},{"$f":"IF(ISBLANK(B50)=TRUE,\" \", IF(B50='2. Metadata'!B$1,'2. Metadata'!B$6, IF(B50='2. Metadata'!C$1,'2. Metadata'!C$6,IF(B50='2. Metadata'!D$1,'2. Metadata'!D$6, IF(B50='2. Metadata'!E$1,'2. Metadata'!E$6,IF( B50='2. Metadata'!F$1,'2. Metadata'!F$6,IF(B50='2. Metadata'!G$1,'2. Metadata'!G$6,IF(B50='2. Metadata'!H$1,'2. Metadata'!H$6, IF(B50='2. Metadata'!I$1,'2. Metadata'!I$6, IF(B50='2. Metadata'!J$1,'2. Metadata'!J$6, IF(B50='2. Metadata'!K$1,'2. Metadata'!K$6, IF(B50='2. Metadata'!L$1,'2. Metadata'!L$6, IF(B50='2. Metadata'!M$1,'2. Metadata'!M$6, IF(B50='2. Metadata'!N$1,'2. Metadata'!N$6))))))))))))))","v":-117.88417},"n/a",11.516,{"$f":"IF(ISBLANK(F50)=TRUE,\" \",'2. Metadata'!B$14)","v":"degrees Celsius"},9.608,{"$f":"IF(ISBLANK(H50)=TRUE,\" \",'2. Metadata'!B$26)","v":"degrees Celsius"},10.426,{"$f":"IF(ISBLANK(J50)=TRUE,\" \",'2. Metadata'!B$38)","v":"degrees Celsius"},"n/a"]
["2013-09-22","NECAR01",{"$f":"IF(ISBLANK(B51)=TRUE,\" \", IF(B51='2. Metadata'!B$1,'2. Metadata'!B$5, IF(B51='2. Metadata'!C$1,'2. Metadata'!C$5,IF(B51='2. Metadata'!D$1,'2. Metadata'!D$5, IF(B51='2. Metadata'!E$1,'2. Metadata'!E$5,IF( B51='2. Metadata'!F$1,'2. Metadata'!F$5,IF(B51='2. Metadata'!G$1,'2. Metadata'!G$5,IF(B51='2. Metadata'!H$1,'2. Metadata'!H$5, IF(B51='2. Metadata'!I$1,'2. Metadata'!I$5, IF(B51='2. Metadata'!J$1,'2. Metadata'!J$5, IF(B51='2. Metadata'!K$1,'2. Metadata'!K$5, IF(B51='2. Metadata'!L$1,'2. Metadata'!L$5, IF(B51='2. Metadata'!M$1,'2. Metadata'!M$5, IF(B51='2. Metadata'!N$1,'2. Metadata'!N$5))))))))))))))","v":49.97944},{"$f":"IF(ISBLANK(B51)=TRUE,\" \", IF(B51='2. Metadata'!B$1,'2. Metadata'!B$6, IF(B51='2. Metadata'!C$1,'2. Metadata'!C$6,IF(B51='2. Metadata'!D$1,'2. Metadata'!D$6, IF(B51='2. Metadata'!E$1,'2. Metadata'!E$6,IF( B51='2. Metadata'!F$1,'2. Metadata'!F$6,IF(B51='2. Metadata'!G$1,'2. Metadata'!G$6,IF(B51='2. Metadata'!H$1,'2. Metadata'!H$6, IF(B51='2. Metadata'!I$1,'2. Metadata'!I$6, IF(B51='2. Metadata'!J$1,'2. Metadata'!J$6, IF(B51='2. Metadata'!K$1,'2. Metadata'!K$6, IF(B51='2. Metadata'!L$1,'2. Metadata'!L$6, IF(B51='2. Metadata'!M$1,'2. Metadata'!M$6, IF(B51='2. Metadata'!N$1,'2. Metadata'!N$6))))))))))))))","v":-117.88417},"n/a",10.956,{"$f":"IF(ISBLANK(F51)=TRUE,\" \",'2. Metadata'!B$14)","v":"degrees Celsius"},9.706,{"$f":"IF(ISBLANK(H51)=TRUE,\" \",'2. Metadata'!B$26)","v":"degrees Celsius"},10.278,{"$f":"IF(ISBLANK(J51)=TRUE,\" \",'2. Metadata'!B$38)","v":"degrees Celsius"},"n/a"]
["2013-09-23","NECAR01",{"$f":"IF(ISBLANK(B52)=TRUE,\" \", IF(B52='2. Metadata'!B$1,'2. Metadata'!B$5, IF(B52='2. Metadata'!C$1,'2. Metadata'!C$5,IF(B52='2. Metadata'!D$1,'2. Metadata'!D$5, IF(B52='2. Metadata'!E$1,'2. Metadata'!E$5,IF( B52='2. Metadata'!F$1,'2. Metadata'!F$5,IF(B52='2. Metadata'!G$1,'2. Metadata'!G$5,IF(B52='2. Metadata'!H$1,'2. Metadata'!H$5, IF(B52='2. Metadata'!I$1,'2. Metadata'!I$5, IF(B52='2. Metadata'!J$1,'2. Metadata'!J$5, IF(B52='2. Metadata'!K$1,'2. Metadata'!K$5, IF(B52='2. Metadata'!L$1,'2. Metadata'!L$5, IF(B52='2. Metadata'!M$1,'2. Metadata'!M$5, IF(B52='2. Metadata'!N$1,'2. Metadata'!N$5))))))))))))))","v":49.97944},{"$f":"IF(ISBLANK(B52)=TRUE,\" \", IF(B52='2. Metadata'!B$1,'2. Metadata'!B$6, IF(B52='2. Metadata'!C$1,'2. Metadata'!C$6,IF(B52='2. Metadata'!D$1,'2. Metadata'!D$6, IF(B52='2. Metadata'!E$1,'2. Metadata'!E$6,IF( B52='2. Metadata'!F$1,'2. Metadata'!F$6,IF(B52='2. Metadata'!G$1,'2. Metadata'!G$6,IF(B52='2. Metadata'!H$1,'2. Metadata'!H$6, IF(B52='2. Metadata'!I$1,'2. Metadata'!I$6, IF(B52='2. Metadata'!J$1,'2. Metadata'!J$6, IF(B52='2. Metadata'!K$1,'2. Metadata'!K$6, IF(B52='2. Metadata'!L$1,'2. Metadata'!L$6, IF(B52='2. Metadata'!M$1,'2. Metadata'!M$6, IF(B52='2. Metadata'!N$1,'2. Metadata'!N$6))))))))))))))","v":-117.88417},"n/a",11.151,{"$f":"IF(ISBLANK(F52)=TRUE,\" \",'2. Metadata'!B$14)","v":"degrees Celsius"},9.756,{"$f":"IF(ISBLANK(H52)=TRUE,\" \",'2. Metadata'!B$26)","v":"degrees Celsius"},10.281,{"$f":"IF(ISBLANK(J52)=TRUE,\" \",'2. Metadata'!B$38)","v":"degrees Celsius"},"n/a"]
["2013-09-24","NECAR01",{"$f":"IF(ISBLANK(B53)=TRUE,\" \", IF(B53='2. Metadata'!B$1,'2. Metadata'!B$5, IF(B53='2. Metadata'!C$1,'2. Metadata'!C$5,IF(B53='2. Metadata'!D$1,'2. Metadata'!D$5, IF(B53='2. Metadata'!E$1,'2. Metadata'!E$5,IF( B53='2. Metadata'!F$1,'2. Metadata'!F$5,IF(B53='2. Metadata'!G$1,'2. Metadata'!G$5,IF(B53='2. Metadata'!H$1,'2. Metadata'!H$5, IF(B53='2. Metadata'!I$1,'2. Metadata'!I$5, IF(B53='2. Metadata'!J$1,'2. Metadata'!J$5, IF(B53='2. Metadata'!K$1,'2. Metadata'!K$5, IF(B53='2. Metadata'!L$1,'2. Metadata'!L$5, IF(B53='2. Metadata'!M$1,'2. Metadata'!M$5, IF(B53='2. Metadata'!N$1,'2. Metadata'!N$5))))))))))))))","v":49.97944},{"$f":"IF(ISBLANK(B53)=TRUE,\" \", IF(B53='2. Metadata'!B$1,'2. Metadata'!B$6, IF(B53='2. Metadata'!C$1,'2. Metadata'!C$6,IF(B53='2. Metadata'!D$1,'2. Metadata'!D$6, IF(B53='2. Metadata'!E$1,'2. Metadata'!E$6,IF( B53='2. Metadata'!F$1,'2. Metadata'!F$6,IF(B53='2. Metadata'!G$1,'2. Metadata'!G$6,IF(B53='2. Metadata'!H$1,'2. Metadata'!H$6, IF(B53='2. Metadata'!I$1,'2. Metadata'!I$6, IF(B53='2. Metadata'!J$1,'2. Metadata'!J$6, IF(B53='2. Metadata'!K$1,'2. Metadata'!K$6, IF(B53='2. Metadata'!L$1,'2. Metadata'!L$6, IF(B53='2. Metadata'!M$1,'2. Metadata'!M$6, IF(B53='2. Metadata'!N$1,'2. Metadata'!N$6))))))))))))))","v":-117.88417},"n/a",10.418,{"$f":"IF(ISBLANK(F53)=TRUE,\" \",'2. Metadata'!B$14)","v":"degrees Celsius"},8.717,{"$f":"IF(ISBLANK(H53)=TRUE,\" \",'2. Metadata'!B$26)","v":"degrees Celsius"},9.46,{"$f":"IF(ISBLANK(J53)=TRUE,\" \",'2. Metadata'!B$38)","v":"degrees Celsius"},"n/a"]
["2013-09-25","NECAR01",{"$f":"IF(ISBLANK(B54)=TRUE,\" \", IF(B54='2. Metadata'!B$1,'2. Metadata'!B$5, IF(B54='2. Metadata'!C$1,'2. Metadata'!C$5,IF(B54='2. Metadata'!D$1,'2. Metadata'!D$5, IF(B54='2. Metadata'!E$1,'2. Metadata'!E$5,IF( B54='2. Metadata'!F$1,'2. Metadata'!F$5,IF(B54='2. Metadata'!G$1,'2. Metadata'!G$5,IF(B54='2. Metadata'!H$1,'2. Metadata'!H$5, IF(B54='2. Metadata'!I$1,'2. Metadata'!I$5, IF(B54='2. Metadata'!J$1,'2. Metadata'!J$5, IF(B54='2. Metadata'!K$1,'2. Metadata'!K$5, IF(B54='2. Metadata'!L$1,'2. Metadata'!L$5, IF(B54='2. Metadata'!M$1,'2. Metadata'!M$5, IF(B54='2. Metadata'!N$1,'2. Metadata'!N$5))))))))))))))","v":49.97944},{"$f":"IF(ISBLANK(B54)=TRUE,\" \", IF(B54='2. Metadata'!B$1,'2. Metadata'!B$6, IF(B54='2. Metadata'!C$1,'2. Metadata'!C$6,IF(B54='2. Metadata'!D$1,'2. Metadata'!D$6, IF(B54='2. Metadata'!E$1,'2. Metadata'!E$6,IF( B54='2. Metadata'!F$1,'2. Metadata'!F$6,IF(B54='2. Metadata'!G$1,'2. Metadata'!G$6,IF(B54='2. Metadata'!H$1,'2. Metadata'!H$6, IF(B54='2. Metadata'!I$1,'2. Metadata'!I$6, IF(B54='2. Metadata'!J$1,'2. Metadata'!J$6, IF(B54='2. Metadata'!K$1,'2. Metadata'!K$6, IF(B54='2. Metadata'!L$1,'2. Metadata'!L$6, IF(B54='2. Metadata'!M$1,'2. Metadata'!M$6, IF(B54='2. Metadata'!N$1,'2. Metadata'!N$6))))))))))))))","v":-117.88417},"n/a",8.593,{"$f":"IF(ISBLANK(F54)=TRUE,\" \",'2. Metadata'!B$14)","v":"degrees Celsius"},7.192,{"$f":"IF(ISBLANK(H54)=TRUE,\" \",'2. Metadata'!B$26)","v":"degrees Celsius"},8.01,{"$f":"IF(ISBLANK(J54)=TRUE,\" \",'2. Metadata'!B$38)","v":"degrees Celsius"},"n/a"]
["2013-09-26","NECAR01",{"$f":"IF(ISBLANK(B55)=TRUE,\" \", IF(B55='2. Metadata'!B$1,'2. Metadata'!B$5, IF(B55='2. Metadata'!C$1,'2. Metadata'!C$5,IF(B55='2. Metadata'!D$1,'2. Metadata'!D$5, IF(B55='2. Metadata'!E$1,'2. Metadata'!E$5,IF( B55='2. Metadata'!F$1,'2. Metadata'!F$5,IF(B55='2. Metadata'!G$1,'2. Metadata'!G$5,IF(B55='2. Metadata'!H$1,'2. Metadata'!H$5, IF(B55='2. Metadata'!I$1,'2. Metadata'!I$5, IF(B55='2. Metadata'!J$1,'2. Metadata'!J$5, IF(B55='2. Metadata'!K$1,'2. Metadata'!K$5, IF(B55='2. Metadata'!L$1,'2. Metadata'!L$5, IF(B55='2. Metadata'!M$1,'2. Metadata'!M$5, IF(B55='2. Metadata'!N$1,'2. Metadata'!N$5))))))))))))))","v":49.97944},{"$f":"IF(ISBLANK(B55)=TRUE,\" \", IF(B55='2. Metadata'!B$1,'2. Metadata'!B$6, IF(B55='2. Metadata'!C$1,'2. Metadata'!C$6,IF(B55='2. Metadata'!D$1,'2. Metadata'!D$6, IF(B55='2. Metadata'!E$1,'2. Metadata'!E$6,IF( B55='2. Metadata'!F$1,'2. Metadata'!F$6,IF(B55='2. Metadata'!G$1,'2. Metadata'!G$6,IF(B55='2. Metadata'!H$1,'2. Metadata'!H$6, IF(B55='2. Metadata'!I$1,'2. Metadata'!I$6, IF(B55='2. Metadata'!J$1,'2. Metadata'!J$6, IF(B55='2. Metadata'!K$1,'2. Metadata'!K$6, IF(B55='2. Metadata'!L$1,'2. Metadata'!L$6, IF(B55='2. Metadata'!M$1,'2. Metadata'!M$6, IF(B55='2. Metadata'!N$1,'2. Metadata'!N$6))))))))))))))","v":-117.88417},"n/a",9.435,{"$f":"IF(ISBLANK(F55)=TRUE,\" \",'2. Metadata'!B$14)","v":"degrees Celsius"},7.845,{"$f":"IF(ISBLANK(H55)=TRUE,\" \",'2. Metadata'!B$26)","v":"degrees Celsius"},8.567,{"$f":"IF(ISBLANK(J55)=TRUE,\" \",'2. Metadata'!B$38)","v":"degrees Celsius"},"n/a"]
["2013-09-27","NECAR01",{"$f":"IF(ISBLANK(B56)=TRUE,\" \", IF(B56='2. Metadata'!B$1,'2. Metadata'!B$5, IF(B56='2. Metadata'!C$1,'2. Metadata'!C$5,IF(B56='2. Metadata'!D$1,'2. Metadata'!D$5, IF(B56='2. Metadata'!E$1,'2. Metadata'!E$5,IF( B56='2. Metadata'!F$1,'2. Metadata'!F$5,IF(B56='2. Metadata'!G$1,'2. Metadata'!G$5,IF(B56='2. Metadata'!H$1,'2. Metadata'!H$5, IF(B56='2. Metadata'!I$1,'2. Metadata'!I$5, IF(B56='2. Metadata'!J$1,'2. Metadata'!J$5, IF(B56='2. Metadata'!K$1,'2. Metadata'!K$5, IF(B56='2. Metadata'!L$1,'2. Metadata'!L$5, IF(B56='2. Metadata'!M$1,'2. Metadata'!M$5, IF(B56='2. Metadata'!N$1,'2. Metadata'!N$5))))))))))))))","v":49.97944},{"$f":"IF(ISBLANK(B56)=TRUE,\" \", IF(B56='2. Metadata'!B$1,'2. Metadata'!B$6, IF(B56='2. Metadata'!C$1,'2. Metadata'!C$6,IF(B56='2. Metadata'!D$1,'2. Metadata'!D$6, IF(B56='2. Metadata'!E$1,'2. Metadata'!E$6,IF( B56='2. Metadata'!F$1,'2. Metadata'!F$6,IF(B56='2. Metadata'!G$1,'2. Metadata'!G$6,IF(B56='2. Metadata'!H$1,'2. Metadata'!H$6, IF(B56='2. Metadata'!I$1,'2. Metadata'!I$6, IF(B56='2. Metadata'!J$1,'2. Metadata'!J$6, IF(B56='2. Metadata'!K$1,'2. Metadata'!K$6, IF(B56='2. Metadata'!L$1,'2. Metadata'!L$6, IF(B56='2. Metadata'!M$1,'2. Metadata'!M$6, IF(B56='2. Metadata'!N$1,'2. Metadata'!N$6))))))))))))))","v":-117.88417},"n/a",7.92,{"$f":"IF(ISBLANK(F56)=TRUE,\" \",'2. Metadata'!B$14)","v":"degrees Celsius"},6.914,{"$f":"IF(ISBLANK(H56)=TRUE,\" \",'2. Metadata'!B$26)","v":"degrees Celsius"},7.473,{"$f":"IF(ISBLANK(J56)=TRUE,\" \",'2. Metadata'!B$38)","v":"degrees Celsius"},"n/a"]
["2013-09-28","NECAR01",{"$f":"IF(ISBLANK(B57)=TRUE,\" \", IF(B57='2. Metadata'!B$1,'2. Metadata'!B$5, IF(B57='2. Metadata'!C$1,'2. Metadata'!C$5,IF(B57='2. Metadata'!D$1,'2. Metadata'!D$5, IF(B57='2. Metadata'!E$1,'2. Metadata'!E$5,IF( B57='2. Metadata'!F$1,'2. Metadata'!F$5,IF(B57='2. Metadata'!G$1,'2. Metadata'!G$5,IF(B57='2. Metadata'!H$1,'2. Metadata'!H$5, IF(B57='2. Metadata'!I$1,'2. Metadata'!I$5, IF(B57='2. Metadata'!J$1,'2. Metadata'!J$5, IF(B57='2. Metadata'!K$1,'2. Metadata'!K$5, IF(B57='2. Metadata'!L$1,'2. Metadata'!L$5, IF(B57='2. Metadata'!M$1,'2. Metadata'!M$5, IF(B57='2. Metadata'!N$1,'2. Metadata'!N$5))))))))))))))","v":49.97944},{"$f":"IF(ISBLANK(B57)=TRUE,\" \", IF(B57='2. Metadata'!B$1,'2. Metadata'!B$6, IF(B57='2. Metadata'!C$1,'2. Metadata'!C$6,IF(B57='2. Metadata'!D$1,'2. Metadata'!D$6, IF(B57='2. Metadata'!E$1,'2. Metadata'!E$6,IF( B57='2. Metadata'!F$1,'2. Metadata'!F$6,IF(B57='2. Metadata'!G$1,'2. Metadata'!G$6,IF(B57='2. Metadata'!H$1,'2. Metadata'!H$6, IF(B57='2. Metadata'!I$1,'2. Metadata'!I$6, IF(B57='2. Metadata'!J$1,'2. Metadata'!J$6, IF(B57='2. Metadata'!K$1,'2. Metadata'!K$6, IF(B57='2. Metadata'!L$1,'2. Metadata'!L$6, IF(B57='2. Metadata'!M$1,'2. Metadata'!M$6, IF(B57='2. Metadata'!N$1,'2. Metadata'!N$6))))))))))))))","v":-117.88417},"n/a",8.394,{"$f":"IF(ISBLANK(F57)=TRUE,\" \",'2. Metadata'!B$14)","v":"degrees Celsius"},7.519,{"$f":"IF(ISBLANK(H57)=TRUE,\" \",'2. Metadata'!B$26)","v":"degrees Celsius"},7.968,{"$f":"IF(ISBLANK(J57)=TRUE,\" \",'2. Metadata'!B$38)","v":"degrees Celsius"},"n/a"]
["2013-09-29","NECAR01",{"$f":"IF(ISBLANK(B58)=TRUE,\" \", IF(B58='2. Metadata'!B$1,'2. Metadata'!B$5, IF(B58='2. Metadata'!C$1,'2. Metadata'!C$5,IF(B58='2. Metadata'!D$1,'2. Metadata'!D$5, IF(B58='2. Metadata'!E$1,'2. Metadata'!E$5,IF( B58='2. Metadata'!F$1,'2. Metadata'!F$5,IF(B58='2. Metadata'!G$1,'2. Metadata'!G$5,IF(B58='2. Metadata'!H$1,'2. Metadata'!H$5, IF(B58='2. Metadata'!I$1,'2. Metadata'!I$5, IF(B58='2. Metadata'!J$1,'2. Metadata'!J$5, IF(B58='2. Metadata'!K$1,'2. Metadata'!K$5, IF(B58='2. Metadata'!L$1,'2. Metadata'!L$5, IF(B58='2. Metadata'!M$1,'2. Metadata'!M$5, IF(B58='2. Metadata'!N$1,'2. Metadata'!N$5))))))))))))))","v":49.97944},{"$f":"IF(ISBLANK(B58)=TRUE,\" \", IF(B58='2. Metadata'!B$1,'2. Metadata'!B$6, IF(B58='2. Metadata'!C$1,'2. Metadata'!C$6,IF(B58='2. Metadata'!D$1,'2. Metadata'!D$6, IF(B58='2. Metadata'!E$1,'2. Metadata'!E$6,IF( B58='2. Metadata'!F$1,'2. Metadata'!F$6,IF(B58='2. Metadata'!G$1,'2. Metadata'!G$6,IF(B58='2. Metadata'!H$1,'2. Metadata'!H$6, IF(B58='2. Metadata'!I$1,'2. Metadata'!I$6, IF(B58='2. Metadata'!J$1,'2. Metadata'!J$6, IF(B58='2. Metadata'!K$1,'2. Metadata'!K$6, IF(B58='2. Metadata'!L$1,'2. Metadata'!L$6, IF(B58='2. Metadata'!M$1,'2. Metadata'!M$6, IF(B58='2. Metadata'!N$1,'2. Metadata'!N$6))))))))))))))","v":-117.88417},"n/a",8.643,{"$f":"IF(ISBLANK(F58)=TRUE,\" \",'2. Metadata'!B$14)","v":"degrees Celsius"},8.045,{"$f":"IF(ISBLANK(H58)=TRUE,\" \",'2. Metadata'!B$26)","v":"degrees Celsius"},8.333,{"$f":"IF(ISBLANK(J58)=TRUE,\" \",'2. Metadata'!B$38)","v":"degrees Celsius"},"n/a"]
["2013-09-30","NECAR01",{"$f":"IF(ISBLANK(B59)=TRUE,\" \", IF(B59='2. Metadata'!B$1,'2. Metadata'!B$5, IF(B59='2. Metadata'!C$1,'2. Metadata'!C$5,IF(B59='2. Metadata'!D$1,'2. Metadata'!D$5, IF(B59='2. Metadata'!E$1,'2. Metadata'!E$5,IF( B59='2. Metadata'!F$1,'2. Metadata'!F$5,IF(B59='2. Metadata'!G$1,'2. Metadata'!G$5,IF(B59='2. Metadata'!H$1,'2. Metadata'!H$5, IF(B59='2. Metadata'!I$1,'2. Metadata'!I$5, IF(B59='2. Metadata'!J$1,'2. Metadata'!J$5, IF(B59='2. Metadata'!K$1,'2. Metadata'!K$5, IF(B59='2. Metadata'!L$1,'2. Metadata'!L$5, IF(B59='2. Metadata'!M$1,'2. Metadata'!M$5, IF(B59='2. Metadata'!N$1,'2. Metadata'!N$5))))))))))))))","v":49.97944},{"$f":"IF(ISBLANK(B59)=TRUE,\" \", IF(B59='2. Metadata'!B$1,'2. Metadata'!B$6, IF(B59='2. Metadata'!C$1,'2. Metadata'!C$6,IF(B59='2. Metadata'!D$1,'2. Metadata'!D$6, IF(B59='2. Metadata'!E$1,'2. Metadata'!E$6,IF( B59='2. Metadata'!F$1,'2. Metadata'!F$6,IF(B59='2. Metadata'!G$1,'2. Metadata'!G$6,IF(B59='2. Metadata'!H$1,'2. Metadata'!H$6, IF(B59='2. Metadata'!I$1,'2. Metadata'!I$6, IF(B59='2. Metadata'!J$1,'2. Metadata'!J$6, IF(B59='2. Metadata'!K$1,'2. Metadata'!K$6, IF(B59='2. Metadata'!L$1,'2. Metadata'!L$6, IF(B59='2. Metadata'!M$1,'2. Metadata'!M$6, IF(B59='2. Metadata'!N$1,'2. Metadata'!N$6))))))))))))))","v":-117.88417},"n/a",8.22,{"$f":"IF(ISBLANK(F59)=TRUE,\" \",'2. Metadata'!B$14)","v":"degrees Celsius"},7.444,{"$f":"IF(ISBLANK(H59)=TRUE,\" \",'2. Metadata'!B$26)","v":"degrees Celsius"},7.905,{"$f":"IF(ISBLANK(J59)=TRUE,\" \",'2. Metadata'!B$38)","v":"degrees Celsius"},"n/a"]
["2013-10-01","NECAR01",{"$f":"IF(ISBLANK(B60)=TRUE,\" \", IF(B60='2. Metadata'!B$1,'2. Metadata'!B$5, IF(B60='2. Metadata'!C$1,'2. Metadata'!C$5,IF(B60='2. Metadata'!D$1,'2. Metadata'!D$5, IF(B60='2. Metadata'!E$1,'2. Metadata'!E$5,IF( B60='2. Metadata'!F$1,'2. Metadata'!F$5,IF(B60='2. Metadata'!G$1,'2. Metadata'!G$5,IF(B60='2. Metadata'!H$1,'2. Metadata'!H$5, IF(B60='2. Metadata'!I$1,'2. Metadata'!I$5, IF(B60='2. Metadata'!J$1,'2. Metadata'!J$5, IF(B60='2. Metadata'!K$1,'2. Metadata'!K$5, IF(B60='2. Metadata'!L$1,'2. Metadata'!L$5, IF(B60='2. Metadata'!M$1,'2. Metadata'!M$5, IF(B60='2. Metadata'!N$1,'2. Metadata'!N$5))))))))))))))","v":49.97944},{"$f":"IF(ISBLANK(B60)=TRUE,\" \", IF(B60='2. Metadata'!B$1,'2. Metadata'!B$6, IF(B60='2. Metadata'!C$1,'2. Metadata'!C$6,IF(B60='2. Metadata'!D$1,'2. Metadata'!D$6, IF(B60='2. Metadata'!E$1,'2. Metadata'!E$6,IF( B60='2. Metadata'!F$1,'2. Metadata'!F$6,IF(B60='2. Metadata'!G$1,'2. Metadata'!G$6,IF(B60='2. Metadata'!H$1,'2. Metadata'!H$6, IF(B60='2. Metadata'!I$1,'2. Metadata'!I$6, IF(B60='2. Metadata'!J$1,'2. Metadata'!J$6, IF(B60='2. Metadata'!K$1,'2. Metadata'!K$6, IF(B60='2. Metadata'!L$1,'2. Metadata'!L$6, IF(B60='2. Metadata'!M$1,'2. Metadata'!M$6, IF(B60='2. Metadata'!N$1,'2. Metadata'!N$6))))))))))))))","v":-117.88417},"n/a",7.97,{"$f":"IF(ISBLANK(F60)=TRUE,\" \",'2. Metadata'!B$14)","v":"degrees Celsius"},6.484,{"$f":"IF(ISBLANK(H60)=TRUE,\" \",'2. Metadata'!B$26)","v":"degrees Celsius"},7.152,{"$f":"IF(ISBLANK(J60)=TRUE,\" \",'2. Metadata'!B$38)","v":"degrees Celsius"},"n/a"]
["2013-10-02","NECAR01",{"$f":"IF(ISBLANK(B61)=TRUE,\" \", IF(B61='2. Metadata'!B$1,'2. Metadata'!B$5, IF(B61='2. Metadata'!C$1,'2. Metadata'!C$5,IF(B61='2. Metadata'!D$1,'2. Metadata'!D$5, IF(B61='2. Metadata'!E$1,'2. Metadata'!E$5,IF( B61='2. Metadata'!F$1,'2. Metadata'!F$5,IF(B61='2. Metadata'!G$1,'2. Metadata'!G$5,IF(B61='2. Metadata'!H$1,'2. Metadata'!H$5, IF(B61='2. Metadata'!I$1,'2. Metadata'!I$5, IF(B61='2. Metadata'!J$1,'2. Metadata'!J$5, IF(B61='2. Metadata'!K$1,'2. Metadata'!K$5, IF(B61='2. Metadata'!L$1,'2. Metadata'!L$5, IF(B61='2. Metadata'!M$1,'2. Metadata'!M$5, IF(B61='2. Metadata'!N$1,'2. Metadata'!N$5))))))))))))))","v":49.97944},{"$f":"IF(ISBLANK(B61)=TRUE,\" \", IF(B61='2. Metadata'!B$1,'2. Metadata'!B$6, IF(B61='2. Metadata'!C$1,'2. Metadata'!C$6,IF(B61='2. Metadata'!D$1,'2. Metadata'!D$6, IF(B61='2. Metadata'!E$1,'2. Metadata'!E$6,IF( B61='2. Metadata'!F$1,'2. Metadata'!F$6,IF(B61='2. Metadata'!G$1,'2. Metadata'!G$6,IF(B61='2. Metadata'!H$1,'2. Metadata'!H$6, IF(B61='2. Metadata'!I$1,'2. Metadata'!I$6, IF(B61='2. Metadata'!J$1,'2. Metadata'!J$6, IF(B61='2. Metadata'!K$1,'2. Metadata'!K$6, IF(B61='2. Metadata'!L$1,'2. Metadata'!L$6, IF(B61='2. Metadata'!M$1,'2. Metadata'!M$6, IF(B61='2. Metadata'!N$1,'2. Metadata'!N$6))))))))))))))","v":-117.88417},"n/a",7.469,{"$f":"IF(ISBLANK(F61)=TRUE,\" \",'2. Metadata'!B$14)","v":"degrees Celsius"},5.693,{"$f":"IF(ISBLANK(H61)=TRUE,\" \",'2. Metadata'!B$26)","v":"degrees Celsius"},6.569,{"$f":"IF(ISBLANK(J61)=TRUE,\" \",'2. Metadata'!B$38)","v":"degrees Celsius"},"n/a"]
["2013-10-03","NECAR01",{"$f":"IF(ISBLANK(B62)=TRUE,\" \", IF(B62='2. Metadata'!B$1,'2. Metadata'!B$5, IF(B62='2. Metadata'!C$1,'2. Metadata'!C$5,IF(B62='2. Metadata'!D$1,'2. Metadata'!D$5, IF(B62='2. Metadata'!E$1,'2. Metadata'!E$5,IF( B62='2. Metadata'!F$1,'2. Metadata'!F$5,IF(B62='2. Metadata'!G$1,'2. Metadata'!G$5,IF(B62='2. Metadata'!H$1,'2. Metadata'!H$5, IF(B62='2. Metadata'!I$1,'2. Metadata'!I$5, IF(B62='2. Metadata'!J$1,'2. Metadata'!J$5, IF(B62='2. Metadata'!K$1,'2. Metadata'!K$5, IF(B62='2. Metadata'!L$1,'2. Metadata'!L$5, IF(B62='2. Metadata'!M$1,'2. Metadata'!M$5, IF(B62='2. Metadata'!N$1,'2. Metadata'!N$5))))))))))))))","v":49.97944},{"$f":"IF(ISBLANK(B62)=TRUE,\" \", IF(B62='2. Metadata'!B$1,'2. Metadata'!B$6, IF(B62='2. Metadata'!C$1,'2. Metadata'!C$6,IF(B62='2. Metadata'!D$1,'2. Metadata'!D$6, IF(B62='2. Metadata'!E$1,'2. Metadata'!E$6,IF( B62='2. Metadata'!F$1,'2. Metadata'!F$6,IF(B62='2. Metadata'!G$1,'2. Metadata'!G$6,IF(B62='2. Metadata'!H$1,'2. Metadata'!H$6, IF(B62='2. Metadata'!I$1,'2. Metadata'!I$6, IF(B62='2. Metadata'!J$1,'2. Metadata'!J$6, IF(B62='2. Metadata'!K$1,'2. Metadata'!K$6, IF(B62='2. Metadata'!L$1,'2. Metadata'!L$6, IF(B62='2. Metadata'!M$1,'2. Metadata'!M$6, IF(B62='2. Metadata'!N$1,'2. Metadata'!N$6))))))))))))))","v":-117.88417},"n/a",7.544,{"$f":"IF(ISBLANK(F62)=TRUE,\" \",'2. Metadata'!B$14)","v":"degrees Celsius"},5.898,{"$f":"IF(ISBLANK(H62)=TRUE,\" \",'2. Metadata'!B$26)","v":"degrees Celsius"},6.548,{"$f":"IF(ISBLANK(J62)=TRUE,\" \",'2. Metadata'!B$38)","v":"degrees Celsius"},"n/a"]
["2013-10-04","NECAR01",{"$f":"IF(ISBLANK(B63)=TRUE,\" \", IF(B63='2. Metadata'!B$1,'2. Metadata'!B$5, IF(B63='2. Metadata'!C$1,'2. Metadata'!C$5,IF(B63='2. Metadata'!D$1,'2. Metadata'!D$5, IF(B63='2. Metadata'!E$1,'2. Metadata'!E$5,IF( B63='2. Metadata'!F$1,'2. Metadata'!F$5,IF(B63='2. Metadata'!G$1,'2. Metadata'!G$5,IF(B63='2. Metadata'!H$1,'2. Metadata'!H$5, IF(B63='2. Metadata'!I$1,'2. Metadata'!I$5, IF(B63='2. Metadata'!J$1,'2. Metadata'!J$5, IF(B63='2. Metadata'!K$1,'2. Metadata'!K$5, IF(B63='2. Metadata'!L$1,'2. Metadata'!L$5, IF(B63='2. Metadata'!M$1,'2. Metadata'!M$5, IF(B63='2. Metadata'!N$1,'2. Metadata'!N$5))))))))))))))","v":49.97944},{"$f":"IF(ISBLANK(B63)=TRUE,\" \", IF(B63='2. Metadata'!B$1,'2. Metadata'!B$6, IF(B63='2. Metadata'!C$1,'2. Metadata'!C$6,IF(B63='2. Metadata'!D$1,'2. Metadata'!D$6, IF(B63='2. Metadata'!E$1,'2. Metadata'!E$6,IF( B63='2. Metadata'!F$1,'2. Metadata'!F$6,IF(B63='2. Metadata'!G$1,'2. Metadata'!G$6,IF(B63='2. Metadata'!H$1,'2. Metadata'!H$6, IF(B63='2. Metadata'!I$1,'2. Metadata'!I$6, IF(B63='2. Metadata'!J$1,'2. Metadata'!J$6, IF(B63='2. Metadata'!K$1,'2. Metadata'!K$6, IF(B63='2. Metadata'!L$1,'2. Metadata'!L$6, IF(B63='2. Metadata'!M$1,'2. Metadata'!M$6, IF(B63='2. Metadata'!N$1,'2. Metadata'!N$6))))))))))))))","v":-117.88417},"n/a",6.535,{"$f":"IF(ISBLANK(F63)=TRUE,\" \",'2. Metadata'!B$14)","v":"degrees Celsius"},4.818,{"$f":"IF(ISBLANK(H63)=TRUE,\" \",'2. Metadata'!B$26)","v":"degrees Celsius"},5.719,{"$f":"IF(ISBLANK(J63)=TRUE,\" \",'2. Metadata'!B$38)","v":"degrees Celsius"},"n/a"]
["2013-10-05","NECAR01",{"$f":"IF(ISBLANK(B64)=TRUE,\" \", IF(B64='2. Metadata'!B$1,'2. Metadata'!B$5, IF(B64='2. Metadata'!C$1,'2. Metadata'!C$5,IF(B64='2. Metadata'!D$1,'2. Metadata'!D$5, IF(B64='2. Metadata'!E$1,'2. Metadata'!E$5,IF( B64='2. Metadata'!F$1,'2. Metadata'!F$5,IF(B64='2. Metadata'!G$1,'2. Metadata'!G$5,IF(B64='2. Metadata'!H$1,'2. Metadata'!H$5, IF(B64='2. Metadata'!I$1,'2. Metadata'!I$5, IF(B64='2. Metadata'!J$1,'2. Metadata'!J$5, IF(B64='2. Metadata'!K$1,'2. Metadata'!K$5, IF(B64='2. Metadata'!L$1,'2. Metadata'!L$5, IF(B64='2. Metadata'!M$1,'2. Metadata'!M$5, IF(B64='2. Metadata'!N$1,'2. Metadata'!N$5))))))))))))))","v":49.97944},{"$f":"IF(ISBLANK(B64)=TRUE,\" \", IF(B64='2. Metadata'!B$1,'2. Metadata'!B$6, IF(B64='2. Metadata'!C$1,'2. Metadata'!C$6,IF(B64='2. Metadata'!D$1,'2. Metadata'!D$6, IF(B64='2. Metadata'!E$1,'2. Metadata'!E$6,IF( B64='2. Metadata'!F$1,'2. Metadata'!F$6,IF(B64='2. Metadata'!G$1,'2. Metadata'!G$6,IF(B64='2. Metadata'!H$1,'2. Metadata'!H$6, IF(B64='2. Metadata'!I$1,'2. Metadata'!I$6, IF(B64='2. Metadata'!J$1,'2. Metadata'!J$6, IF(B64='2. Metadata'!K$1,'2. Metadata'!K$6, IF(B64='2. Metadata'!L$1,'2. Metadata'!L$6, IF(B64='2. Metadata'!M$1,'2. Metadata'!M$6, IF(B64='2. Metadata'!N$1,'2. Metadata'!N$6))))))))))))))","v":-117.88417},"n/a",7.92,{"$f":"IF(ISBLANK(F64)=TRUE,\" \",'2. Metadata'!B$14)","v":"degrees Celsius"},6.051,{"$f":"IF(ISBLANK(H64)=TRUE,\" \",'2. Metadata'!B$26)","v":"degrees Celsius"},7.009,{"$f":"IF(ISBLANK(J64)=TRUE,\" \",'2. Metadata'!B$38)","v":"degrees Celsius"},"n/a"]
["2013-10-06","NECAR01",{"$f":"IF(ISBLANK(B65)=TRUE,\" \", IF(B65='2. Metadata'!B$1,'2. Metadata'!B$5, IF(B65='2. Metadata'!C$1,'2. Metadata'!C$5,IF(B65='2. Metadata'!D$1,'2. Metadata'!D$5, IF(B65='2. Metadata'!E$1,'2. Metadata'!E$5,IF( B65='2. Metadata'!F$1,'2. Metadata'!F$5,IF(B65='2. Metadata'!G$1,'2. Metadata'!G$5,IF(B65='2. Metadata'!H$1,'2. Metadata'!H$5, IF(B65='2. Metadata'!I$1,'2. Metadata'!I$5, IF(B65='2. Metadata'!J$1,'2. Metadata'!J$5, IF(B65='2. Metadata'!K$1,'2. Metadata'!K$5, IF(B65='2. Metadata'!L$1,'2. Metadata'!L$5, IF(B65='2. Metadata'!M$1,'2. Metadata'!M$5, IF(B65='2. Metadata'!N$1,'2. Metadata'!N$5))))))))))))))","v":49.97944},{"$f":"IF(ISBLANK(B65)=TRUE,\" \", IF(B65='2. Metadata'!B$1,'2. Metadata'!B$6, IF(B65='2. Metadata'!C$1,'2. Metadata'!C$6,IF(B65='2. Metadata'!D$1,'2. Metadata'!D$6, IF(B65='2. Metadata'!E$1,'2. Metadata'!E$6,IF( B65='2. Metadata'!F$1,'2. Metadata'!F$6,IF(B65='2. Metadata'!G$1,'2. Metadata'!G$6,IF(B65='2. Metadata'!H$1,'2. Metadata'!H$6, IF(B65='2. Metadata'!I$1,'2. Metadata'!I$6, IF(B65='2. Metadata'!J$1,'2. Metadata'!J$6, IF(B65='2. Metadata'!K$1,'2. Metadata'!K$6, IF(B65='2. Metadata'!L$1,'2. Metadata'!L$6, IF(B65='2. Metadata'!M$1,'2. Metadata'!M$6, IF(B65='2. Metadata'!N$1,'2. Metadata'!N$6))))))))))))))","v":-117.88417},"n/a",8.444,{"$f":"IF(ISBLANK(F65)=TRUE,\" \",'2. Metadata'!B$14)","v":"degrees Celsius"},6.712,{"$f":"IF(ISBLANK(H65)=TRUE,\" \",'2. Metadata'!B$26)","v":"degrees Celsius"},7.464,{"$f":"IF(ISBLANK(J65)=TRUE,\" \",'2. Metadata'!B$38)","v":"degrees Celsius"},"n/a"]
["2013-10-07","NECAR01",{"$f":"IF(ISBLANK(B66)=TRUE,\" \", IF(B66='2. Metadata'!B$1,'2. Metadata'!B$5, IF(B66='2. Metadata'!C$1,'2. Metadata'!C$5,IF(B66='2. Metadata'!D$1,'2. Metadata'!D$5, IF(B66='2. Metadata'!E$1,'2. Metadata'!E$5,IF( B66='2. Metadata'!F$1,'2. Metadata'!F$5,IF(B66='2. Metadata'!G$1,'2. Metadata'!G$5,IF(B66='2. Metadata'!H$1,'2. Metadata'!H$5, IF(B66='2. Metadata'!I$1,'2. Metadata'!I$5, IF(B66='2. Metadata'!J$1,'2. Metadata'!J$5, IF(B66='2. Metadata'!K$1,'2. Metadata'!K$5, IF(B66='2. Metadata'!L$1,'2. Metadata'!L$5, IF(B66='2. Metadata'!M$1,'2. Metadata'!M$5, IF(B66='2. Metadata'!N$1,'2. Metadata'!N$5))))))))))))))","v":49.97944},{"$f":"IF(ISBLANK(B66)=TRUE,\" \", IF(B66='2. Metadata'!B$1,'2. Metadata'!B$6, IF(B66='2. Metadata'!C$1,'2. Metadata'!C$6,IF(B66='2. Metadata'!D$1,'2. Metadata'!D$6, IF(B66='2. Metadata'!E$1,'2. Metadata'!E$6,IF( B66='2. Metadata'!F$1,'2. Metadata'!F$6,IF(B66='2. Metadata'!G$1,'2. Metadata'!G$6,IF(B66='2. Metadata'!H$1,'2. Metadata'!H$6, IF(B66='2. Metadata'!I$1,'2. Metadata'!I$6, IF(B66='2. Metadata'!J$1,'2. Metadata'!J$6, IF(B66='2. Metadata'!K$1,'2. Metadata'!K$6, IF(B66='2. Metadata'!L$1,'2. Metadata'!L$6, IF(B66='2. Metadata'!M$1,'2. Metadata'!M$6, IF(B66='2. Metadata'!N$1,'2. Metadata'!N$6))))))))))))))","v":-117.88417},"n/a",7.594,{"$f":"IF(ISBLANK(F66)=TRUE,\" \",'2. Metadata'!B$14)","v":"degrees Celsius"},6.433,{"$f":"IF(ISBLANK(H66)=TRUE,\" \",'2. Metadata'!B$26)","v":"degrees Celsius"},7.016,{"$f":"IF(ISBLANK(J66)=TRUE,\" \",'2. Metadata'!B$38)","v":"degrees Celsius"},"n/a"]
["2013-10-08","NECAR01",{"$f":"IF(ISBLANK(B67)=TRUE,\" \", IF(B67='2. Metadata'!B$1,'2. Metadata'!B$5, IF(B67='2. Metadata'!C$1,'2. Metadata'!C$5,IF(B67='2. Metadata'!D$1,'2. Metadata'!D$5, IF(B67='2. Metadata'!E$1,'2. Metadata'!E$5,IF( B67='2. Metadata'!F$1,'2. Metadata'!F$5,IF(B67='2. Metadata'!G$1,'2. Metadata'!G$5,IF(B67='2. Metadata'!H$1,'2. Metadata'!H$5, IF(B67='2. Metadata'!I$1,'2. Metadata'!I$5, IF(B67='2. Metadata'!J$1,'2. Metadata'!J$5, IF(B67='2. Metadata'!K$1,'2. Metadata'!K$5, IF(B67='2. Metadata'!L$1,'2. Metadata'!L$5, IF(B67='2. Metadata'!M$1,'2. Metadata'!M$5, IF(B67='2. Metadata'!N$1,'2. Metadata'!N$5))))))))))))))","v":49.97944},{"$f":"IF(ISBLANK(B67)=TRUE,\" \", IF(B67='2. Metadata'!B$1,'2. Metadata'!B$6, IF(B67='2. Metadata'!C$1,'2. Metadata'!C$6,IF(B67='2. Metadata'!D$1,'2. Metadata'!D$6, IF(B67='2. Metadata'!E$1,'2. Metadata'!E$6,IF( B67='2. Metadata'!F$1,'2. Metadata'!F$6,IF(B67='2. Metadata'!G$1,'2. Metadata'!G$6,IF(B67='2. Metadata'!H$1,'2. Metadata'!H$6, IF(B67='2. Metadata'!I$1,'2. Metadata'!I$6, IF(B67='2. Metadata'!J$1,'2. Metadata'!J$6, IF(B67='2. Metadata'!K$1,'2. Metadata'!K$6, IF(B67='2. Metadata'!L$1,'2. Metadata'!L$6, IF(B67='2. Metadata'!M$1,'2. Metadata'!M$6, IF(B67='2. Metadata'!N$1,'2. Metadata'!N$6))))))))))))))","v":-117.88417},"n/a",8.195,{"$f":"IF(ISBLANK(F67)=TRUE,\" \",'2. Metadata'!B$14)","v":"degrees Celsius"},6.914,{"$f":"IF(ISBLANK(H67)=TRUE,\" \",'2. Metadata'!B$26)","v":"degrees Celsius"},7.309,{"$f":"IF(ISBLANK(J67)=TRUE,\" \",'2. Metadata'!B$38)","v":"degrees Celsius"},"n/a"]
["2013-10-09","NECAR01",{"$f":"IF(ISBLANK(B68)=TRUE,\" \", IF(B68='2. Metadata'!B$1,'2. Metadata'!B$5, IF(B68='2. Metadata'!C$1,'2. Metadata'!C$5,IF(B68='2. Metadata'!D$1,'2. Metadata'!D$5, IF(B68='2. Metadata'!E$1,'2. Metadata'!E$5,IF( B68='2. Metadata'!F$1,'2. Metadata'!F$5,IF(B68='2. Metadata'!G$1,'2. Metadata'!G$5,IF(B68='2. Metadata'!H$1,'2. Metadata'!H$5, IF(B68='2. Metadata'!I$1,'2. Metadata'!I$5, IF(B68='2. Metadata'!J$1,'2. Metadata'!J$5, IF(B68='2. Metadata'!K$1,'2. Metadata'!K$5, IF(B68='2. Metadata'!L$1,'2. Metadata'!L$5, IF(B68='2. Metadata'!M$1,'2. Metadata'!M$5, IF(B68='2. Metadata'!N$1,'2. Metadata'!N$5))))))))))))))","v":49.97944},{"$f":"IF(ISBLANK(B68)=TRUE,\" \", IF(B68='2. Metadata'!B$1,'2. Metadata'!B$6, IF(B68='2. Metadata'!C$1,'2. Metadata'!C$6,IF(B68='2. Metadata'!D$1,'2. Metadata'!D$6, IF(B68='2. Metadata'!E$1,'2. Metadata'!E$6,IF( B68='2. Metadata'!F$1,'2. Metadata'!F$6,IF(B68='2. Metadata'!G$1,'2. Metadata'!G$6,IF(B68='2. Metadata'!H$1,'2. Metadata'!H$6, IF(B68='2. Metadata'!I$1,'2. Metadata'!I$6, IF(B68='2. Metadata'!J$1,'2. Metadata'!J$6, IF(B68='2. Metadata'!K$1,'2. Metadata'!K$6, IF(B68='2. Metadata'!L$1,'2. Metadata'!L$6, IF(B68='2. Metadata'!M$1,'2. Metadata'!M$6, IF(B68='2. Metadata'!N$1,'2. Metadata'!N$6))))))))))))))","v":-117.88417},"n/a",7.268,{"$f":"IF(ISBLANK(F68)=TRUE,\" \",'2. Metadata'!B$14)","v":"degrees Celsius"},6.102,{"$f":"IF(ISBLANK(H68)=TRUE,\" \",'2. Metadata'!B$26)","v":"degrees Celsius"},6.701,{"$f":"IF(ISBLANK(J68)=TRUE,\" \",'2. Metadata'!B$38)","v":"degrees Celsius"},"n/a"]
["2013-10-10","NECAR01",{"$f":"IF(ISBLANK(B69)=TRUE,\" \", IF(B69='2. Metadata'!B$1,'2. Metadata'!B$5, IF(B69='2. Metadata'!C$1,'2. Metadata'!C$5,IF(B69='2. Metadata'!D$1,'2. Metadata'!D$5, IF(B69='2. Metadata'!E$1,'2. Metadata'!E$5,IF( B69='2. Metadata'!F$1,'2. Metadata'!F$5,IF(B69='2. Metadata'!G$1,'2. Metadata'!G$5,IF(B69='2. Metadata'!H$1,'2. Metadata'!H$5, IF(B69='2. Metadata'!I$1,'2. Metadata'!I$5, IF(B69='2. Metadata'!J$1,'2. Metadata'!J$5, IF(B69='2. Metadata'!K$1,'2. Metadata'!K$5, IF(B69='2. Metadata'!L$1,'2. Metadata'!L$5, IF(B69='2. Metadata'!M$1,'2. Metadata'!M$5, IF(B69='2. Metadata'!N$1,'2. Metadata'!N$5))))))))))))))","v":49.97944},{"$f":"IF(ISBLANK(B69)=TRUE,\" \", IF(B69='2. Metadata'!B$1,'2. Metadata'!B$6, IF(B69='2. Metadata'!C$1,'2. Metadata'!C$6,IF(B69='2. Metadata'!D$1,'2. Metadata'!D$6, IF(B69='2. Metadata'!E$1,'2. Metadata'!E$6,IF( B69='2. Metadata'!F$1,'2. Metadata'!F$6,IF(B69='2. Metadata'!G$1,'2. Metadata'!G$6,IF(B69='2. Metadata'!H$1,'2. Metadata'!H$6, IF(B69='2. Metadata'!I$1,'2. Metadata'!I$6, IF(B69='2. Metadata'!J$1,'2. Metadata'!J$6, IF(B69='2. Metadata'!K$1,'2. Metadata'!K$6, IF(B69='2. Metadata'!L$1,'2. Metadata'!L$6, IF(B69='2. Metadata'!M$1,'2. Metadata'!M$6, IF(B69='2. Metadata'!N$1,'2. Metadata'!N$6))))))))))))))","v":-117.88417},"n/a",7.494,{"$f":"IF(ISBLANK(F69)=TRUE,\" \",'2. Metadata'!B$14)","v":"degrees Celsius"},6.331,{"$f":"IF(ISBLANK(H69)=TRUE,\" \",'2. Metadata'!B$26)","v":"degrees Celsius"},6.901,{"$f":"IF(ISBLANK(J69)=TRUE,\" \",'2. Metadata'!B$38)","v":"degrees Celsius"},"n/a"]
["2013-10-11","NECAR01",{"$f":"IF(ISBLANK(B70)=TRUE,\" \", IF(B70='2. Metadata'!B$1,'2. Metadata'!B$5, IF(B70='2. Metadata'!C$1,'2. Metadata'!C$5,IF(B70='2. Metadata'!D$1,'2. Metadata'!D$5, IF(B70='2. Metadata'!E$1,'2. Metadata'!E$5,IF( B70='2. Metadata'!F$1,'2. Metadata'!F$5,IF(B70='2. Metadata'!G$1,'2. Metadata'!G$5,IF(B70='2. Metadata'!H$1,'2. Metadata'!H$5, IF(B70='2. Metadata'!I$1,'2. Metadata'!I$5, IF(B70='2. Metadata'!J$1,'2. Metadata'!J$5, IF(B70='2. Metadata'!K$1,'2. Metadata'!K$5, IF(B70='2. Metadata'!L$1,'2. Metadata'!L$5, IF(B70='2. Metadata'!M$1,'2. Metadata'!M$5, IF(B70='2. Metadata'!N$1,'2. Metadata'!N$5))))))))))))))","v":49.97944},{"$f":"IF(ISBLANK(B70)=TRUE,\" \", IF(B70='2. Metadata'!B$1,'2. Metadata'!B$6, IF(B70='2. Metadata'!C$1,'2. Metadata'!C$6,IF(B70='2. Metadata'!D$1,'2. Metadata'!D$6, IF(B70='2. Metadata'!E$1,'2. Metadata'!E$6,IF( B70='2. Metadata'!F$1,'2. Metadata'!F$6,IF(B70='2. Metadata'!G$1,'2. Metadata'!G$6,IF(B70='2. Metadata'!H$1,'2. Metadata'!H$6, IF(B70='2. Metadata'!I$1,'2. Metadata'!I$6, IF(B70='2. Metadata'!J$1,'2. Metadata'!J$6, IF(B70='2. Metadata'!K$1,'2. Metadata'!K$6, IF(B70='2. Metadata'!L$1,'2. Metadata'!L$6, IF(B70='2. Metadata'!M$1,'2. Metadata'!M$6, IF(B70='2. Metadata'!N$1,'2. Metadata'!N$6))))))))))))))","v":-117.88417},"n/a",6.281,{"$f":"IF(ISBLANK(F70)=TRUE,\" \",'2. Metadata'!B$14)","v":"degrees Celsius"},4.869,{"$f":"IF(ISBLANK(H70)=TRUE,\" \",'2. Metadata'!B$26)","v":"degrees Celsius"},5.689,{"$f":"IF(ISBLANK(J70)=TRUE,\" \",'2. Metadata'!B$38)","v":"degrees Celsius"},"n/a"]
["2013-10-12","NECAR01",{"$f":"IF(ISBLANK(B71)=TRUE,\" \", IF(B71='2. Metadata'!B$1,'2. Metadata'!B$5, IF(B71='2. Metadata'!C$1,'2. Metadata'!C$5,IF(B71='2. Metadata'!D$1,'2. Metadata'!D$5, IF(B71='2. Metadata'!E$1,'2. Metadata'!E$5,IF( B71='2. Metadata'!F$1,'2. Metadata'!F$5,IF(B71='2. Metadata'!G$1,'2. Metadata'!G$5,IF(B71='2. Metadata'!H$1,'2. Metadata'!H$5, IF(B71='2. Metadata'!I$1,'2. Metadata'!I$5, IF(B71='2. Metadata'!J$1,'2. Metadata'!J$5, IF(B71='2. Metadata'!K$1,'2. Metadata'!K$5, IF(B71='2. Metadata'!L$1,'2. Metadata'!L$5, IF(B71='2. Metadata'!M$1,'2. Metadata'!M$5, IF(B71='2. Metadata'!N$1,'2. Metadata'!N$5))))))))))))))","v":49.97944},{"$f":"IF(ISBLANK(B71)=TRUE,\" \", IF(B71='2. Metadata'!B$1,'2. Metadata'!B$6, IF(B71='2. Metadata'!C$1,'2. Metadata'!C$6,IF(B71='2. Metadata'!D$1,'2. Metadata'!D$6, IF(B71='2. Metadata'!E$1,'2. Metadata'!E$6,IF( B71='2. Metadata'!F$1,'2. Metadata'!F$6,IF(B71='2. Metadata'!G$1,'2. Metadata'!G$6,IF(B71='2. Metadata'!H$1,'2. Metadata'!H$6, IF(B71='2. Metadata'!I$1,'2. Metadata'!I$6, IF(B71='2. Metadata'!J$1,'2. Metadata'!J$6, IF(B71='2. Metadata'!K$1,'2. Metadata'!K$6, IF(B71='2. Metadata'!L$1,'2. Metadata'!L$6, IF(B71='2. Metadata'!M$1,'2. Metadata'!M$6, IF(B71='2. Metadata'!N$1,'2. Metadata'!N$6))))))))))))))","v":-117.88417},"n/a",6.331,{"$f":"IF(ISBLANK(F71)=TRUE,\" \",'2. Metadata'!B$14)","v":"degrees Celsius"},5.05,{"$f":"IF(ISBLANK(H71)=TRUE,\" \",'2. Metadata'!B$26)","v":"degrees Celsius"},5.703,{"$f":"IF(ISBLANK(J71)=TRUE,\" \",'2. Metadata'!B$38)","v":"degrees Celsius"},"n/a"]
["2013-10-13","NECAR01",{"$f":"IF(ISBLANK(B72)=TRUE,\" \", IF(B72='2. Metadata'!B$1,'2. Metadata'!B$5, IF(B72='2. Metadata'!C$1,'2. Metadata'!C$5,IF(B72='2. Metadata'!D$1,'2. Metadata'!D$5, IF(B72='2. Metadata'!E$1,'2. Metadata'!E$5,IF( B72='2. Metadata'!F$1,'2. Metadata'!F$5,IF(B72='2. Metadata'!G$1,'2. Metadata'!G$5,IF(B72='2. Metadata'!H$1,'2. Metadata'!H$5, IF(B72='2. Metadata'!I$1,'2. Metadata'!I$5, IF(B72='2. Metadata'!J$1,'2. Metadata'!J$5, IF(B72='2. Metadata'!K$1,'2. Metadata'!K$5, IF(B72='2. Metadata'!L$1,'2. Metadata'!L$5, IF(B72='2. Metadata'!M$1,'2. Metadata'!M$5, IF(B72='2. Metadata'!N$1,'2. Metadata'!N$5))))))))))))))","v":49.97944},{"$f":"IF(ISBLANK(B72)=TRUE,\" \", IF(B72='2. Metadata'!B$1,'2. Metadata'!B$6, IF(B72='2. Metadata'!C$1,'2. Metadata'!C$6,IF(B72='2. Metadata'!D$1,'2. Metadata'!D$6, IF(B72='2. Metadata'!E$1,'2. Metadata'!E$6,IF( B72='2. Metadata'!F$1,'2. Metadata'!F$6,IF(B72='2. Metadata'!G$1,'2. Metadata'!G$6,IF(B72='2. Metadata'!H$1,'2. Metadata'!H$6, IF(B72='2. Metadata'!I$1,'2. Metadata'!I$6, IF(B72='2. Metadata'!J$1,'2. Metadata'!J$6, IF(B72='2. Metadata'!K$1,'2. Metadata'!K$6, IF(B72='2. Metadata'!L$1,'2. Metadata'!L$6, IF(B72='2. Metadata'!M$1,'2. Metadata'!M$6, IF(B72='2. Metadata'!N$1,'2. Metadata'!N$6))))))))))))))","v":-117.88417},"n/a",5.949,{"$f":"IF(ISBLANK(F72)=TRUE,\" \",'2. Metadata'!B$14)","v":"degrees Celsius"},4.22,{"$f":"IF(ISBLANK(H72)=TRUE,\" \",'2. Metadata'!B$26)","v":"degrees Celsius"},5.24,{"$f":"IF(ISBLANK(J72)=TRUE,\" \",'2. Metadata'!B$38)","v":"degrees Celsius"},"n/a"]
["2013-10-14","NECAR01",{"$f":"IF(ISBLANK(B73)=TRUE,\" \", IF(B73='2. Metadata'!B$1,'2. Metadata'!B$5, IF(B73='2. Metadata'!C$1,'2. Metadata'!C$5,IF(B73='2. Metadata'!D$1,'2. Metadata'!D$5, IF(B73='2. Metadata'!E$1,'2. Metadata'!E$5,IF( B73='2. Metadata'!F$1,'2. Metadata'!F$5,IF(B73='2. Metadata'!G$1,'2. Metadata'!G$5,IF(B73='2. Metadata'!H$1,'2. Metadata'!H$5, IF(B73='2. Metadata'!I$1,'2. Metadata'!I$5, IF(B73='2. Metadata'!J$1,'2. Metadata'!J$5, IF(B73='2. Metadata'!K$1,'2. Metadata'!K$5, IF(B73='2. Metadata'!L$1,'2. Metadata'!L$5, IF(B73='2. Metadata'!M$1,'2. Metadata'!M$5, IF(B73='2. Metadata'!N$1,'2. Metadata'!N$5))))))))))))))","v":49.97944},{"$f":"IF(ISBLANK(B73)=TRUE,\" \", IF(B73='2. Metadata'!B$1,'2. Metadata'!B$6, IF(B73='2. Metadata'!C$1,'2. Metadata'!C$6,IF(B73='2. Metadata'!D$1,'2. Metadata'!D$6, IF(B73='2. Metadata'!E$1,'2. Metadata'!E$6,IF( B73='2. Metadata'!F$1,'2. Metadata'!F$6,IF(B73='2. Metadata'!G$1,'2. Metadata'!G$6,IF(B73='2. Metadata'!H$1,'2. Metadata'!H$6, IF(B73='2. Metadata'!I$1,'2. Metadata'!I$6, IF(B73='2. Metadata'!J$1,'2. Metadata'!J$6, IF(B73='2. Metadata'!K$1,'2. Metadata'!K$6, IF(B73='2. Metadata'!L$1,'2. Metadata'!L$6, IF(B73='2. Metadata'!M$1,'2. Metadata'!M$6, IF(B73='2. Metadata'!N$1,'2. Metadata'!N$6))))))))))))))","v":-117.88417},"n/a",5.591,{"$f":"IF(ISBLANK(F73)=TRUE,\" \",'2. Metadata'!B$14)","v":"degrees Celsius"},4.168,{"$f":"IF(ISBLANK(H73)=TRUE,\" \",'2. Metadata'!B$26)","v":"degrees Celsius"},4.849,{"$f":"IF(ISBLANK(J73)=TRUE,\" \",'2. Metadata'!B$38)","v":"degrees Celsius"},"n/a"]
["2013-10-15","NECAR01",{"$f":"IF(ISBLANK(B74)=TRUE,\" \", IF(B74='2. Metadata'!B$1,'2. Metadata'!B$5, IF(B74='2. Metadata'!C$1,'2. Metadata'!C$5,IF(B74='2. Metadata'!D$1,'2. Metadata'!D$5, IF(B74='2. Metadata'!E$1,'2. Metadata'!E$5,IF( B74='2. Metadata'!F$1,'2. Metadata'!F$5,IF(B74='2. Metadata'!G$1,'2. Metadata'!G$5,IF(B74='2. Metadata'!H$1,'2. Metadata'!H$5, IF(B74='2. Metadata'!I$1,'2. Metadata'!I$5, IF(B74='2. Metadata'!J$1,'2. Metadata'!J$5, IF(B74='2. Metadata'!K$1,'2. Metadata'!K$5, IF(B74='2. Metadata'!L$1,'2. Metadata'!L$5, IF(B74='2. Metadata'!M$1,'2. Metadata'!M$5, IF(B74='2. Metadata'!N$1,'2. Metadata'!N$5))))))))))))))","v":49.97944},{"$f":"IF(ISBLANK(B74)=TRUE,\" \", IF(B74='2. Metadata'!B$1,'2. Metadata'!B$6, IF(B74='2. Metadata'!C$1,'2. Metadata'!C$6,IF(B74='2. Metadata'!D$1,'2. Metadata'!D$6, IF(B74='2. Metadata'!E$1,'2. Metadata'!E$6,IF( B74='2. Metadata'!F$1,'2. Metadata'!F$6,IF(B74='2. Metadata'!G$1,'2. Metadata'!G$6,IF(B74='2. Metadata'!H$1,'2. Metadata'!H$6, IF(B74='2. Metadata'!I$1,'2. Metadata'!I$6, IF(B74='2. Metadata'!J$1,'2. Metadata'!J$6, IF(B74='2. Metadata'!K$1,'2. Metadata'!K$6, IF(B74='2. Metadata'!L$1,'2. Metadata'!L$6, IF(B74='2. Metadata'!M$1,'2. Metadata'!M$6, IF(B74='2. Metadata'!N$1,'2. Metadata'!N$6))))))))))))))","v":-117.88417},"n/a",5.411,{"$f":"IF(ISBLANK(F74)=TRUE,\" \",'2. Metadata'!B$14)","v":"degrees Celsius"},3.564,{"$f":"IF(ISBLANK(H74)=TRUE,\" \",'2. Metadata'!B$26)","v":"degrees Celsius"},4.54,{"$f":"IF(ISBLANK(J74)=TRUE,\" \",'2. Metadata'!B$38)","v":"degrees Celsius"},"n/a"]
["2013-10-16","NECAR01",{"$f":"IF(ISBLANK(B75)=TRUE,\" \", IF(B75='2. Metadata'!B$1,'2. Metadata'!B$5, IF(B75='2. Metadata'!C$1,'2. Metadata'!C$5,IF(B75='2. Metadata'!D$1,'2. Metadata'!D$5, IF(B75='2. Metadata'!E$1,'2. Metadata'!E$5,IF( B75='2. Metadata'!F$1,'2. Metadata'!F$5,IF(B75='2. Metadata'!G$1,'2. Metadata'!G$5,IF(B75='2. Metadata'!H$1,'2. Metadata'!H$5, IF(B75='2. Metadata'!I$1,'2. Metadata'!I$5, IF(B75='2. Metadata'!J$1,'2. Metadata'!J$5, IF(B75='2. Metadata'!K$1,'2. Metadata'!K$5, IF(B75='2. Metadata'!L$1,'2. Metadata'!L$5, IF(B75='2. Metadata'!M$1,'2. Metadata'!M$5, IF(B75='2. Metadata'!N$1,'2. Metadata'!N$5))))))))))))))","v":49.97944},{"$f":"IF(ISBLANK(B75)=TRUE,\" \", IF(B75='2. Metadata'!B$1,'2. Metadata'!B$6, IF(B75='2. Metadata'!C$1,'2. Metadata'!C$6,IF(B75='2. Metadata'!D$1,'2. Metadata'!D$6, IF(B75='2. Metadata'!E$1,'2. Metadata'!E$6,IF( B75='2. Metadata'!F$1,'2. Metadata'!F$6,IF(B75='2. Metadata'!G$1,'2. Metadata'!G$6,IF(B75='2. Metadata'!H$1,'2. Metadata'!H$6, IF(B75='2. Metadata'!I$1,'2. Metadata'!I$6, IF(B75='2. Metadata'!J$1,'2. Metadata'!J$6, IF(B75='2. Metadata'!K$1,'2. Metadata'!K$6, IF(B75='2. Metadata'!L$1,'2. Metadata'!L$6, IF(B75='2. Metadata'!M$1,'2. Metadata'!M$6, IF(B75='2. Metadata'!N$1,'2. Metadata'!N$6))))))))))))))","v":-117.88417},"n/a",6.661,{"$f":"IF(ISBLANK(F75)=TRUE,\" \",'2. Metadata'!B$14)","v":"degrees Celsius"},5.205,{"$f":"IF(ISBLANK(H75)=TRUE,\" \",'2. Metadata'!B$26)","v":"degrees Celsius"},5.878,{"$f":"IF(ISBLANK(J75)=TRUE,\" \",'2. Metadata'!B$38)","v":"degrees Celsius"},"n/a"]
["2013-10-17","NECAR01",{"$f":"IF(ISBLANK(B76)=TRUE,\" \", IF(B76='2. Metadata'!B$1,'2. Metadata'!B$5, IF(B76='2. Metadata'!C$1,'2. Metadata'!C$5,IF(B76='2. Metadata'!D$1,'2. Metadata'!D$5, IF(B76='2. Metadata'!E$1,'2. Metadata'!E$5,IF( B76='2. Metadata'!F$1,'2. Metadata'!F$5,IF(B76='2. Metadata'!G$1,'2. Metadata'!G$5,IF(B76='2. Metadata'!H$1,'2. Metadata'!H$5, IF(B76='2. Metadata'!I$1,'2. Metadata'!I$5, IF(B76='2. Metadata'!J$1,'2. Metadata'!J$5, IF(B76='2. Metadata'!K$1,'2. Metadata'!K$5, IF(B76='2. Metadata'!L$1,'2. Metadata'!L$5, IF(B76='2. Metadata'!M$1,'2. Metadata'!M$5, IF(B76='2. Metadata'!N$1,'2. Metadata'!N$5))))))))))))))","v":49.97944},{"$f":"IF(ISBLANK(B76)=TRUE,\" \", IF(B76='2. Metadata'!B$1,'2. Metadata'!B$6, IF(B76='2. Metadata'!C$1,'2. Metadata'!C$6,IF(B76='2. Metadata'!D$1,'2. Metadata'!D$6, IF(B76='2. Metadata'!E$1,'2. Metadata'!E$6,IF( B76='2. Metadata'!F$1,'2. Metadata'!F$6,IF(B76='2. Metadata'!G$1,'2. Metadata'!G$6,IF(B76='2. Metadata'!H$1,'2. Metadata'!H$6, IF(B76='2. Metadata'!I$1,'2. Metadata'!I$6, IF(B76='2. Metadata'!J$1,'2. Metadata'!J$6, IF(B76='2. Metadata'!K$1,'2. Metadata'!K$6, IF(B76='2. Metadata'!L$1,'2. Metadata'!L$6, IF(B76='2. Metadata'!M$1,'2. Metadata'!M$6, IF(B76='2. Metadata'!N$1,'2. Metadata'!N$6))))))))))))))","v":-117.88417},"n/a",5.975,{"$f":"IF(ISBLANK(F76)=TRUE,\" \",'2. Metadata'!B$14)","v":"degrees Celsius"},4.74,{"$f":"IF(ISBLANK(H76)=TRUE,\" \",'2. Metadata'!B$26)","v":"degrees Celsius"},5.292,{"$f":"IF(ISBLANK(J76)=TRUE,\" \",'2. Metadata'!B$38)","v":"degrees Celsius"},"n/a"]
["2013-10-18","NECAR01",{"$f":"IF(ISBLANK(B77)=TRUE,\" \", IF(B77='2. Metadata'!B$1,'2. Metadata'!B$5, IF(B77='2. Metadata'!C$1,'2. Metadata'!C$5,IF(B77='2. Metadata'!D$1,'2. Metadata'!D$5, IF(B77='2. Metadata'!E$1,'2. Metadata'!E$5,IF( B77='2. Metadata'!F$1,'2. Metadata'!F$5,IF(B77='2. Metadata'!G$1,'2. Metadata'!G$5,IF(B77='2. Metadata'!H$1,'2. Metadata'!H$5, IF(B77='2. Metadata'!I$1,'2. Metadata'!I$5, IF(B77='2. Metadata'!J$1,'2. Metadata'!J$5, IF(B77='2. Metadata'!K$1,'2. Metadata'!K$5, IF(B77='2. Metadata'!L$1,'2. Metadata'!L$5, IF(B77='2. Metadata'!M$1,'2. Metadata'!M$5, IF(B77='2. Metadata'!N$1,'2. Metadata'!N$5))))))))))))))","v":49.97944},{"$f":"IF(ISBLANK(B77)=TRUE,\" \", IF(B77='2. Metadata'!B$1,'2. Metadata'!B$6, IF(B77='2. Metadata'!C$1,'2. Metadata'!C$6,IF(B77='2. Metadata'!D$1,'2. Metadata'!D$6, IF(B77='2. Metadata'!E$1,'2. Metadata'!E$6,IF( B77='2. Metadata'!F$1,'2. Metadata'!F$6,IF(B77='2. Metadata'!G$1,'2. Metadata'!G$6,IF(B77='2. Metadata'!H$1,'2. Metadata'!H$6, IF(B77='2. Metadata'!I$1,'2. Metadata'!I$6, IF(B77='2. Metadata'!J$1,'2. Metadata'!J$6, IF(B77='2. Metadata'!K$1,'2. Metadata'!K$6, IF(B77='2. Metadata'!L$1,'2. Metadata'!L$6, IF(B77='2. Metadata'!M$1,'2. Metadata'!M$6, IF(B77='2. Metadata'!N$1,'2. Metadata'!N$6))))))))))))))","v":-117.88417},"n/a",5.205,{"$f":"IF(ISBLANK(F77)=TRUE,\" \",'2. Metadata'!B$14)","v":"degrees Celsius"},4.011,{"$f":"IF(ISBLANK(H77)=TRUE,\" \",'2. Metadata'!B$26)","v":"degrees Celsius"},4.533,{"$f":"IF(ISBLANK(J77)=TRUE,\" \",'2. Metadata'!B$38)","v":"degrees Celsius"},"n/a"]
["2013-10-19","NECAR01",{"$f":"IF(ISBLANK(B78)=TRUE,\" \", IF(B78='2. Metadata'!B$1,'2. Metadata'!B$5, IF(B78='2. Metadata'!C$1,'2. Metadata'!C$5,IF(B78='2. Metadata'!D$1,'2. Metadata'!D$5, IF(B78='2. Metadata'!E$1,'2. Metadata'!E$5,IF( B78='2. Metadata'!F$1,'2. Metadata'!F$5,IF(B78='2. Metadata'!G$1,'2. Metadata'!G$5,IF(B78='2. Metadata'!H$1,'2. Metadata'!H$5, IF(B78='2. Metadata'!I$1,'2. Metadata'!I$5, IF(B78='2. Metadata'!J$1,'2. Metadata'!J$5, IF(B78='2. Metadata'!K$1,'2. Metadata'!K$5, IF(B78='2. Metadata'!L$1,'2. Metadata'!L$5, IF(B78='2. Metadata'!M$1,'2. Metadata'!M$5, IF(B78='2. Metadata'!N$1,'2. Metadata'!N$5))))))))))))))","v":49.97944},{"$f":"IF(ISBLANK(B78)=TRUE,\" \", IF(B78='2. Metadata'!B$1,'2. Metadata'!B$6, IF(B78='2. Metadata'!C$1,'2. Metadata'!C$6,IF(B78='2. Metadata'!D$1,'2. Metadata'!D$6, IF(B78='2. Metadata'!E$1,'2. Metadata'!E$6,IF( B78='2. Metadata'!F$1,'2. Metadata'!F$6,IF(B78='2. Metadata'!G$1,'2. Metadata'!G$6,IF(B78='2. Metadata'!H$1,'2. Metadata'!H$6, IF(B78='2. Metadata'!I$1,'2. Metadata'!I$6, IF(B78='2. Metadata'!J$1,'2. Metadata'!J$6, IF(B78='2. Metadata'!K$1,'2. Metadata'!K$6, IF(B78='2. Metadata'!L$1,'2. Metadata'!L$6, IF(B78='2. Metadata'!M$1,'2. Metadata'!M$6, IF(B78='2. Metadata'!N$1,'2. Metadata'!N$6))))))))))))))","v":-117.88417},"n/a",5.282,{"$f":"IF(ISBLANK(F78)=TRUE,\" \",'2. Metadata'!B$14)","v":"degrees Celsius"},4.011,{"$f":"IF(ISBLANK(H78)=TRUE,\" \",'2. Metadata'!B$26)","v":"degrees Celsius"},4.554,{"$f":"IF(ISBLANK(J78)=TRUE,\" \",'2. Metadata'!B$38)","v":"degrees Celsius"},"n/a"]
["2013-10-20","NECAR01",{"$f":"IF(ISBLANK(B79)=TRUE,\" \", IF(B79='2. Metadata'!B$1,'2. Metadata'!B$5, IF(B79='2. Metadata'!C$1,'2. Metadata'!C$5,IF(B79='2. Metadata'!D$1,'2. Metadata'!D$5, IF(B79='2. Metadata'!E$1,'2. Metadata'!E$5,IF( B79='2. Metadata'!F$1,'2. Metadata'!F$5,IF(B79='2. Metadata'!G$1,'2. Metadata'!G$5,IF(B79='2. Metadata'!H$1,'2. Metadata'!H$5, IF(B79='2. Metadata'!I$1,'2. Metadata'!I$5, IF(B79='2. Metadata'!J$1,'2. Metadata'!J$5, IF(B79='2. Metadata'!K$1,'2. Metadata'!K$5, IF(B79='2. Metadata'!L$1,'2. Metadata'!L$5, IF(B79='2. Metadata'!M$1,'2. Metadata'!M$5, IF(B79='2. Metadata'!N$1,'2. Metadata'!N$5))))))))))))))","v":49.97944},{"$f":"IF(ISBLANK(B79)=TRUE,\" \", IF(B79='2. Metadata'!B$1,'2. Metadata'!B$6, IF(B79='2. Metadata'!C$1,'2. Metadata'!C$6,IF(B79='2. Metadata'!D$1,'2. Metadata'!D$6, IF(B79='2. Metadata'!E$1,'2. Metadata'!E$6,IF( B79='2. Metadata'!F$1,'2. Metadata'!F$6,IF(B79='2. Metadata'!G$1,'2. Metadata'!G$6,IF(B79='2. Metadata'!H$1,'2. Metadata'!H$6, IF(B79='2. Metadata'!I$1,'2. Metadata'!I$6, IF(B79='2. Metadata'!J$1,'2. Metadata'!J$6, IF(B79='2. Metadata'!K$1,'2. Metadata'!K$6, IF(B79='2. Metadata'!L$1,'2. Metadata'!L$6, IF(B79='2. Metadata'!M$1,'2. Metadata'!M$6, IF(B79='2. Metadata'!N$1,'2. Metadata'!N$6))))))))))))))","v":-117.88417},"n/a",6.026,{"$f":"IF(ISBLANK(F79)=TRUE,\" \",'2. Metadata'!B$14)","v":"degrees Celsius"},4.74,{"$f":"IF(ISBLANK(H79)=TRUE,\" \",'2. Metadata'!B$26)","v":"degrees Celsius"},5.221,{"$f":"IF(ISBLANK(J79)=TRUE,\" \",'2. Metadata'!B$38)","v":"degrees Celsius"},"n/a"]
["2013-10-21","NECAR01",{"$f":"IF(ISBLANK(B80)=TRUE,\" \", IF(B80='2. Metadata'!B$1,'2. Metadata'!B$5, IF(B80='2. Metadata'!C$1,'2. Metadata'!C$5,IF(B80='2. Metadata'!D$1,'2. Metadata'!D$5, IF(B80='2. Metadata'!E$1,'2. Metadata'!E$5,IF( B80='2. Metadata'!F$1,'2. Metadata'!F$5,IF(B80='2. Metadata'!G$1,'2. Metadata'!G$5,IF(B80='2. Metadata'!H$1,'2. Metadata'!H$5, IF(B80='2. Metadata'!I$1,'2. Metadata'!I$5, IF(B80='2. Metadata'!J$1,'2. Metadata'!J$5, IF(B80='2. Metadata'!K$1,'2. Metadata'!K$5, IF(B80='2. Metadata'!L$1,'2. Metadata'!L$5, IF(B80='2. Metadata'!M$1,'2. Metadata'!M$5, IF(B80='2. Metadata'!N$1,'2. Metadata'!N$5))))))))))))))","v":49.97944},{"$f":"IF(ISBLANK(B80)=TRUE,\" \", IF(B80='2. Metadata'!B$1,'2. Metadata'!B$6, IF(B80='2. Metadata'!C$1,'2. Metadata'!C$6,IF(B80='2. Metadata'!D$1,'2. Metadata'!D$6, IF(B80='2. Metadata'!E$1,'2. Metadata'!E$6,IF( B80='2. Metadata'!F$1,'2. Metadata'!F$6,IF(B80='2. Metadata'!G$1,'2. Metadata'!G$6,IF(B80='2. Metadata'!H$1,'2. Metadata'!H$6, IF(B80='2. Metadata'!I$1,'2. Metadata'!I$6, IF(B80='2. Metadata'!J$1,'2. Metadata'!J$6, IF(B80='2. Metadata'!K$1,'2. Metadata'!K$6, IF(B80='2. Metadata'!L$1,'2. Metadata'!L$6, IF(B80='2. Metadata'!M$1,'2. Metadata'!M$6, IF(B80='2. Metadata'!N$1,'2. Metadata'!N$6))))))))))))))","v":-117.88417},"n/a",5.872,{"$f":"IF(ISBLANK(F80)=TRUE,\" \",'2. Metadata'!B$14)","v":"degrees Celsius"},5.154,{"$f":"IF(ISBLANK(H80)=TRUE,\" \",'2. Metadata'!B$26)","v":"degrees Celsius"},5.49,{"$f":"IF(ISBLANK(J80)=TRUE,\" \",'2. Metadata'!B$38)","v":"degrees Celsius"},"n/a"]
["2013-10-22","NECAR01",{"$f":"IF(ISBLANK(B81)=TRUE,\" \", IF(B81='2. Metadata'!B$1,'2. Metadata'!B$5, IF(B81='2. Metadata'!C$1,'2. Metadata'!C$5,IF(B81='2. Metadata'!D$1,'2. Metadata'!D$5, IF(B81='2. Metadata'!E$1,'2. Metadata'!E$5,IF( B81='2. Metadata'!F$1,'2. Metadata'!F$5,IF(B81='2. Metadata'!G$1,'2. Metadata'!G$5,IF(B81='2. Metadata'!H$1,'2. Metadata'!H$5, IF(B81='2. Metadata'!I$1,'2. Metadata'!I$5, IF(B81='2. Metadata'!J$1,'2. Metadata'!J$5, IF(B81='2. Metadata'!K$1,'2. Metadata'!K$5, IF(B81='2. Metadata'!L$1,'2. Metadata'!L$5, IF(B81='2. Metadata'!M$1,'2. Metadata'!M$5, IF(B81='2. Metadata'!N$1,'2. Metadata'!N$5))))))))))))))","v":49.97944},{"$f":"IF(ISBLANK(B81)=TRUE,\" \", IF(B81='2. Metadata'!B$1,'2. Metadata'!B$6, IF(B81='2. Metadata'!C$1,'2. Metadata'!C$6,IF(B81='2. Metadata'!D$1,'2. Metadata'!D$6, IF(B81='2. Metadata'!E$1,'2. Metadata'!E$6,IF( B81='2. Metadata'!F$1,'2. Metadata'!F$6,IF(B81='2. Metadata'!G$1,'2. Metadata'!G$6,IF(B81='2. Metadata'!H$1,'2. Metadata'!H$6, IF(B81='2. Metadata'!I$1,'2. Metadata'!I$6, IF(B81='2. Metadata'!J$1,'2. Metadata'!J$6, IF(B81='2. Metadata'!K$1,'2. Metadata'!K$6, IF(B81='2. Metadata'!L$1,'2. Metadata'!L$6, IF(B81='2. Metadata'!M$1,'2. Metadata'!M$6, IF(B81='2. Metadata'!N$1,'2. Metadata'!N$6))))))))))))))","v":-117.88417},"n/a",5.616,{"$f":"IF(ISBLANK(F81)=TRUE,\" \",'2. Metadata'!B$14)","v":"degrees Celsius"},4.999,{"$f":"IF(ISBLANK(H81)=TRUE,\" \",'2. Metadata'!B$26)","v":"degrees Celsius"},5.368,{"$f":"IF(ISBLANK(J81)=TRUE,\" \",'2. Metadata'!B$38)","v":"degrees Celsius"},"n/a"]
["2013-10-23","NECAR01",{"$f":"IF(ISBLANK(B82)=TRUE,\" \", IF(B82='2. Metadata'!B$1,'2. Metadata'!B$5, IF(B82='2. Metadata'!C$1,'2. Metadata'!C$5,IF(B82='2. Metadata'!D$1,'2. Metadata'!D$5, IF(B82='2. Metadata'!E$1,'2. Metadata'!E$5,IF( B82='2. Metadata'!F$1,'2. Metadata'!F$5,IF(B82='2. Metadata'!G$1,'2. Metadata'!G$5,IF(B82='2. Metadata'!H$1,'2. Metadata'!H$5, IF(B82='2. Metadata'!I$1,'2. Metadata'!I$5, IF(B82='2. Metadata'!J$1,'2. Metadata'!J$5, IF(B82='2. Metadata'!K$1,'2. Metadata'!K$5, IF(B82='2. Metadata'!L$1,'2. Metadata'!L$5, IF(B82='2. Metadata'!M$1,'2. Metadata'!M$5, IF(B82='2. Metadata'!N$1,'2. Metadata'!N$5))))))))))))))","v":49.97944},{"$f":"IF(ISBLANK(B82)=TRUE,\" \", IF(B82='2. Metadata'!B$1,'2. Metadata'!B$6, IF(B82='2. Metadata'!C$1,'2. Metadata'!C$6,IF(B82='2. Metadata'!D$1,'2. Metadata'!D$6, IF(B82='2. Metadata'!E$1,'2. Metadata'!E$6,IF( B82='2. Metadata'!F$1,'2. Metadata'!F$6,IF(B82='2. Metadata'!G$1,'2. Metadata'!G$6,IF(B82='2. Metadata'!H$1,'2. Metadata'!H$6, IF(B82='2. Metadata'!I$1,'2. Metadata'!I$6, IF(B82='2. Metadata'!J$1,'2. Metadata'!J$6, IF(B82='2. Metadata'!K$1,'2. Metadata'!K$6, IF(B82='2. Metadata'!L$1,'2. Metadata'!L$6, IF(B82='2. Metadata'!M$1,'2. Metadata'!M$6, IF(B82='2. Metadata'!N$1,'2. Metadata'!N$6))))))))))))))","v":-117.88417},"n/a",5.821,{"$f":"IF(ISBLANK(F82)=TRUE,\" \",'2. Metadata'!B$14)","v":"degrees Celsius"},5.024,{"$f":"IF(ISBLANK(H82)=TRUE,\" \",'2. Metadata'!B$26)","v":"degrees Celsius"},5.415,{"$f":"IF(ISBLANK(J82)=TRUE,\" \",'2. Metadata'!B$38)","v":"degrees Celsius"},"n/a"]
["2013-10-24","NECAR01",{"$f":"IF(ISBLANK(B83)=TRUE,\" \", IF(B83='2. Metadata'!B$1,'2. Metadata'!B$5, IF(B83='2. Metadata'!C$1,'2. Metadata'!C$5,IF(B83='2. Metadata'!D$1,'2. Metadata'!D$5, IF(B83='2. Metadata'!E$1,'2. Metadata'!E$5,IF( B83='2. Metadata'!F$1,'2. Metadata'!F$5,IF(B83='2. Metadata'!G$1,'2. Metadata'!G$5,IF(B83='2. Metadata'!H$1,'2. Metadata'!H$5, IF(B83='2. Metadata'!I$1,'2. Metadata'!I$5, IF(B83='2. Metadata'!J$1,'2. Metadata'!J$5, IF(B83='2. Metadata'!K$1,'2. Metadata'!K$5, IF(B83='2. Metadata'!L$1,'2. Metadata'!L$5, IF(B83='2. Metadata'!M$1,'2. Metadata'!M$5, IF(B83='2. Metadata'!N$1,'2. Metadata'!N$5))))))))))))))","v":49.97944},{"$f":"IF(ISBLANK(B83)=TRUE,\" \", IF(B83='2. Metadata'!B$1,'2. Metadata'!B$6, IF(B83='2. Metadata'!C$1,'2. Metadata'!C$6,IF(B83='2. Metadata'!D$1,'2. Metadata'!D$6, IF(B83='2. Metadata'!E$1,'2. Metadata'!E$6,IF( B83='2. Metadata'!F$1,'2. Metadata'!F$6,IF(B83='2. Metadata'!G$1,'2. Metadata'!G$6,IF(B83='2. Metadata'!H$1,'2. Metadata'!H$6, IF(B83='2. Metadata'!I$1,'2. Metadata'!I$6, IF(B83='2. Metadata'!J$1,'2. Metadata'!J$6, IF(B83='2. Metadata'!K$1,'2. Metadata'!K$6, IF(B83='2. Metadata'!L$1,'2. Metadata'!L$6, IF(B83='2. Metadata'!M$1,'2. Metadata'!M$6, IF(B83='2. Metadata'!N$1,'2. Metadata'!N$6))))))))))))))","v":-117.88417},"n/a",5.488,{"$f":"IF(ISBLANK(F83)=TRUE,\" \",'2. Metadata'!B$14)","v":"degrees Celsius"},4.947,{"$f":"IF(ISBLANK(H83)=TRUE,\" \",'2. Metadata'!B$26)","v":"degrees Celsius"},5.275,{"$f":"IF(ISBLANK(J83)=TRUE,\" \",'2. Metadata'!B$38)","v":"degrees Celsius"},"n/a"]
["2013-10-25","NECAR01",{"$f":"IF(ISBLANK(B84)=TRUE,\" \", IF(B84='2. Metadata'!B$1,'2. Metadata'!B$5, IF(B84='2. Metadata'!C$1,'2. Metadata'!C$5,IF(B84='2. Metadata'!D$1,'2. Metadata'!D$5, IF(B84='2. Metadata'!E$1,'2. Metadata'!E$5,IF( B84='2. Metadata'!F$1,'2. Metadata'!F$5,IF(B84='2. Metadata'!G$1,'2. Metadata'!G$5,IF(B84='2. Metadata'!H$1,'2. Metadata'!H$5, IF(B84='2. Metadata'!I$1,'2. Metadata'!I$5, IF(B84='2. Metadata'!J$1,'2. Metadata'!J$5, IF(B84='2. Metadata'!K$1,'2. Metadata'!K$5, IF(B84='2. Metadata'!L$1,'2. Metadata'!L$5, IF(B84='2. Metadata'!M$1,'2. Metadata'!M$5, IF(B84='2. Metadata'!N$1,'2. Metadata'!N$5))))))))))))))","v":49.97944},{"$f":"IF(ISBLANK(B84)=TRUE,\" \", IF(B84='2. Metadata'!B$1,'2. Metadata'!B$6, IF(B84='2. Metadata'!C$1,'2. Metadata'!C$6,IF(B84='2. Metadata'!D$1,'2. Metadata'!D$6, IF(B84='2. Metadata'!E$1,'2. Metadata'!E$6,IF( B84='2. Metadata'!F$1,'2. Metadata'!F$6,IF(B84='2. Metadata'!G$1,'2. Metadata'!G$6,IF(B84='2. Metadata'!H$1,'2. Metadata'!H$6, IF(B84='2. Metadata'!I$1,'2. Metadata'!I$6, IF(B84='2. Metadata'!J$1,'2. Metadata'!J$6, IF(B84='2. Metadata'!K$1,'2. Metadata'!K$6, IF(B84='2. Metadata'!L$1,'2. Metadata'!L$6, IF(B84='2. Metadata'!M$1,'2. Metadata'!M$6, IF(B84='2. Metadata'!N$1,'2. Metadata'!N$6))))))))))))))","v":-117.88417},"n/a",5.282,{"$f":"IF(ISBLANK(F84)=TRUE,\" \",'2. Metadata'!B$14)","v":"degrees Celsius"},4.792,{"$f":"IF(ISBLANK(H84)=TRUE,\" \",'2. Metadata'!B$26)","v":"degrees Celsius"},5.093,{"$f":"IF(ISBLANK(J84)=TRUE,\" \",'2. Metadata'!B$38)","v":"degrees Celsius"},"n/a"]
["2013-10-26","NECAR01",{"$f":"IF(ISBLANK(B85)=TRUE,\" \", IF(B85='2. Metadata'!B$1,'2. Metadata'!B$5, IF(B85='2. Metadata'!C$1,'2. Metadata'!C$5,IF(B85='2. Metadata'!D$1,'2. Metadata'!D$5, IF(B85='2. Metadata'!E$1,'2. Metadata'!E$5,IF( B85='2. Metadata'!F$1,'2. Metadata'!F$5,IF(B85='2. Metadata'!G$1,'2. Metadata'!G$5,IF(B85='2. Metadata'!H$1,'2. Metadata'!H$5, IF(B85='2. Metadata'!I$1,'2. Metadata'!I$5, IF(B85='2. Metadata'!J$1,'2. Metadata'!J$5, IF(B85='2. Metadata'!K$1,'2. Metadata'!K$5, IF(B85='2. Metadata'!L$1,'2. Metadata'!L$5, IF(B85='2. Metadata'!M$1,'2. Metadata'!M$5, IF(B85='2. Metadata'!N$1,'2. Metadata'!N$5))))))))))))))","v":49.97944},{"$f":"IF(ISBLANK(B85)=TRUE,\" \", IF(B85='2. Metadata'!B$1,'2. Metadata'!B$6, IF(B85='2. Metadata'!C$1,'2. Metadata'!C$6,IF(B85='2. Metadata'!D$1,'2. Metadata'!D$6, IF(B85='2. Metadata'!E$1,'2. Metadata'!E$6,IF( B85='2. Metadata'!F$1,'2. Metadata'!F$6,IF(B85='2. Metadata'!G$1,'2. Metadata'!G$6,IF(B85='2. Metadata'!H$1,'2. Metadata'!H$6, IF(B85='2. Metadata'!I$1,'2. Metadata'!I$6, IF(B85='2. Metadata'!J$1,'2. Metadata'!J$6, IF(B85='2. Metadata'!K$1,'2. Metadata'!K$6, IF(B85='2. Metadata'!L$1,'2. Metadata'!L$6, IF(B85='2. Metadata'!M$1,'2. Metadata'!M$6, IF(B85='2. Metadata'!N$1,'2. Metadata'!N$6))))))))))))))","v":-117.88417},"n/a",5.128,{"$f":"IF(ISBLANK(F85)=TRUE,\" \",'2. Metadata'!B$14)","v":"degrees Celsius"},4.662,{"$f":"IF(ISBLANK(H85)=TRUE,\" \",'2. Metadata'!B$26)","v":"degrees Celsius"},4.912,{"$f":"IF(ISBLANK(J85)=TRUE,\" \",'2. Metadata'!B$38)","v":"degrees Celsius"},"n/a"]
["2013-10-27","NECAR01",{"$f":"IF(ISBLANK(B86)=TRUE,\" \", IF(B86='2. Metadata'!B$1,'2. Metadata'!B$5, IF(B86='2. Metadata'!C$1,'2. Metadata'!C$5,IF(B86='2. Metadata'!D$1,'2. Metadata'!D$5, IF(B86='2. Metadata'!E$1,'2. Metadata'!E$5,IF( B86='2. Metadata'!F$1,'2. Metadata'!F$5,IF(B86='2. Metadata'!G$1,'2. Metadata'!G$5,IF(B86='2. Metadata'!H$1,'2. Metadata'!H$5, IF(B86='2. Metadata'!I$1,'2. Metadata'!I$5, IF(B86='2. Metadata'!J$1,'2. Metadata'!J$5, IF(B86='2. Metadata'!K$1,'2. Metadata'!K$5, IF(B86='2. Metadata'!L$1,'2. Metadata'!L$5, IF(B86='2. Metadata'!M$1,'2. Metadata'!M$5, IF(B86='2. Metadata'!N$1,'2. Metadata'!N$5))))))))))))))","v":49.97944},{"$f":"IF(ISBLANK(B86)=TRUE,\" \", IF(B86='2. Metadata'!B$1,'2. Metadata'!B$6, IF(B86='2. Metadata'!C$1,'2. Metadata'!C$6,IF(B86='2. Metadata'!D$1,'2. Metadata'!D$6, IF(B86='2. Metadata'!E$1,'2. Metadata'!E$6,IF( B86='2. Metadata'!F$1,'2. Metadata'!F$6,IF(B86='2. Metadata'!G$1,'2. Metadata'!G$6,IF(B86='2. Metadata'!H$1,'2. Metadata'!H$6, IF(B86='2. Metadata'!I$1,'2. Metadata'!I$6, IF(B86='2. Metadata'!J$1,'2. Metadata'!J$6, IF(B86='2. Metadata'!K$1,'2. Metadata'!K$6, IF(B86='2. Metadata'!L$1,'2. Metadata'!L$6, IF(B86='2. Metadata'!M$1,'2. Metadata'!M$6, IF(B86='2. Metadata'!N$1,'2. Metadata'!N$6))))))))))))))","v":-117.88417},"n/a",5.514,{"$f":"IF(ISBLANK(F86)=TRUE,\" \",'2. Metadata'!B$14)","v":"degrees Celsius"},4.636,{"$f":"IF(ISBLANK(H86)=TRUE,\" \",'2. Metadata'!B$26)","v":"degrees Celsius"},5.008,{"$f":"IF(ISBLANK(J86)=TRUE,\" \",'2. Metadata'!B$38)","v":"degrees Celsius"},"n/a"]
["2013-10-28","NECAR01",{"$f":"IF(ISBLANK(B87)=TRUE,\" \", IF(B87='2. Metadata'!B$1,'2. Metadata'!B$5, IF(B87='2. Metadata'!C$1,'2. Metadata'!C$5,IF(B87='2. Metadata'!D$1,'2. Metadata'!D$5, IF(B87='2. Metadata'!E$1,'2. Metadata'!E$5,IF( B87='2. Metadata'!F$1,'2. Metadata'!F$5,IF(B87='2. Metadata'!G$1,'2. Metadata'!G$5,IF(B87='2. Metadata'!H$1,'2. Metadata'!H$5, IF(B87='2. Metadata'!I$1,'2. Metadata'!I$5, IF(B87='2. Metadata'!J$1,'2. Metadata'!J$5, IF(B87='2. Metadata'!K$1,'2. Metadata'!K$5, IF(B87='2. Metadata'!L$1,'2. Metadata'!L$5, IF(B87='2. Metadata'!M$1,'2. Metadata'!M$5, IF(B87='2. Metadata'!N$1,'2. Metadata'!N$5))))))))))))))","v":49.97944},{"$f":"IF(ISBLANK(B87)=TRUE,\" \", IF(B87='2. Metadata'!B$1,'2. Metadata'!B$6, IF(B87='2. Metadata'!C$1,'2. Metadata'!C$6,IF(B87='2. Metadata'!D$1,'2. Metadata'!D$6, IF(B87='2. Metadata'!E$1,'2. Metadata'!E$6,IF( B87='2. Metadata'!F$1,'2. Metadata'!F$6,IF(B87='2. Metadata'!G$1,'2. Metadata'!G$6,IF(B87='2. Metadata'!H$1,'2. Metadata'!H$6, IF(B87='2. Metadata'!I$1,'2. Metadata'!I$6, IF(B87='2. Metadata'!J$1,'2. Metadata'!J$6, IF(B87='2. Metadata'!K$1,'2. Metadata'!K$6, IF(B87='2. Metadata'!L$1,'2. Metadata'!L$6, IF(B87='2. Metadata'!M$1,'2. Metadata'!M$6, IF(B87='2. Metadata'!N$1,'2. Metadata'!N$6))))))))))))))","v":-117.88417},"n/a",4.506,{"$f":"IF(ISBLANK(F87)=TRUE,\" \",'2. Metadata'!B$14)","v":"degrees Celsius"},2.956,{"$f":"IF(ISBLANK(H87)=TRUE,\" \",'2. Metadata'!B$26)","v":"degrees Celsius"},3.699,{"$f":"IF(ISBLANK(J87)=TRUE,\" \",'2. Metadata'!B$38)","v":"degrees Celsius"},"n/a"]
["2013-10-29","NECAR01",{"$f":"IF(ISBLANK(B88)=TRUE,\" \", IF(B88='2. Metadata'!B$1,'2. Metadata'!B$5, IF(B88='2. Metadata'!C$1,'2. Metadata'!C$5,IF(B88='2. Metadata'!D$1,'2. Metadata'!D$5, IF(B88='2. Metadata'!E$1,'2. Metadata'!E$5,IF( B88='2. Metadata'!F$1,'2. Metadata'!F$5,IF(B88='2. Metadata'!G$1,'2. Metadata'!G$5,IF(B88='2. Metadata'!H$1,'2. Metadata'!H$5, IF(B88='2. Metadata'!I$1,'2. Metadata'!I$5, IF(B88='2. Metadata'!J$1,'2. Metadata'!J$5, IF(B88='2. Metadata'!K$1,'2. Metadata'!K$5, IF(B88='2. Metadata'!L$1,'2. Metadata'!L$5, IF(B88='2. Metadata'!M$1,'2. Metadata'!M$5, IF(B88='2. Metadata'!N$1,'2. Metadata'!N$5))))))))))))))","v":49.97944},{"$f":"IF(ISBLANK(B88)=TRUE,\" \", IF(B88='2. Metadata'!B$1,'2. Metadata'!B$6, IF(B88='2. Metadata'!C$1,'2. Metadata'!C$6,IF(B88='2. Metadata'!D$1,'2. Metadata'!D$6, IF(B88='2. Metadata'!E$1,'2. Metadata'!E$6,IF( B88='2. Metadata'!F$1,'2. Metadata'!F$6,IF(B88='2. Metadata'!G$1,'2. Metadata'!G$6,IF(B88='2. Metadata'!H$1,'2. Metadata'!H$6, IF(B88='2. Metadata'!I$1,'2. Metadata'!I$6, IF(B88='2. Metadata'!J$1,'2. Metadata'!J$6, IF(B88='2. Metadata'!K$1,'2. Metadata'!K$6, IF(B88='2. Metadata'!L$1,'2. Metadata'!L$6, IF(B88='2. Metadata'!M$1,'2. Metadata'!M$6, IF(B88='2. Metadata'!N$1,'2. Metadata'!N$6))))))))))))))","v":-117.88417},"n/a",3.168,{"$f":"IF(ISBLANK(F88)=TRUE,\" \",'2. Metadata'!B$14)","v":"degrees Celsius"},2.155,{"$f":"IF(ISBLANK(H88)=TRUE,\" \",'2. Metadata'!B$26)","v":"degrees Celsius"},2.595,{"$f":"IF(ISBLANK(J88)=TRUE,\" \",'2. Metadata'!B$38)","v":"degrees Celsius"},"n/a"]
["2013-10-30","NECAR01",{"$f":"IF(ISBLANK(B89)=TRUE,\" \", IF(B89='2. Metadata'!B$1,'2. Metadata'!B$5, IF(B89='2. Metadata'!C$1,'2. Metadata'!C$5,IF(B89='2. Metadata'!D$1,'2. Metadata'!D$5, IF(B89='2. Metadata'!E$1,'2. Metadata'!E$5,IF( B89='2. Metadata'!F$1,'2. Metadata'!F$5,IF(B89='2. Metadata'!G$1,'2. Metadata'!G$5,IF(B89='2. Metadata'!H$1,'2. Metadata'!H$5, IF(B89='2. Metadata'!I$1,'2. Metadata'!I$5, IF(B89='2. Metadata'!J$1,'2. Metadata'!J$5, IF(B89='2. Metadata'!K$1,'2. Metadata'!K$5, IF(B89='2. Metadata'!L$1,'2. Metadata'!L$5, IF(B89='2. Metadata'!M$1,'2. Metadata'!M$5, IF(B89='2. Metadata'!N$1,'2. Metadata'!N$5))))))))))))))","v":49.97944},{"$f":"IF(ISBLANK(B89)=TRUE,\" \", IF(B89='2. Metadata'!B$1,'2. Metadata'!B$6, IF(B89='2. Metadata'!C$1,'2. Metadata'!C$6,IF(B89='2. Metadata'!D$1,'2. Metadata'!D$6, IF(B89='2. Metadata'!E$1,'2. Metadata'!E$6,IF( B89='2. Metadata'!F$1,'2. Metadata'!F$6,IF(B89='2. Metadata'!G$1,'2. Metadata'!G$6,IF(B89='2. Metadata'!H$1,'2. Metadata'!H$6, IF(B89='2. Metadata'!I$1,'2. Metadata'!I$6, IF(B89='2. Metadata'!J$1,'2. Metadata'!J$6, IF(B89='2. Metadata'!K$1,'2. Metadata'!K$6, IF(B89='2. Metadata'!L$1,'2. Metadata'!L$6, IF(B89='2. Metadata'!M$1,'2. Metadata'!M$6, IF(B89='2. Metadata'!N$1,'2. Metadata'!N$6))))))))))))))","v":-117.88417},"n/a",3.643,{"$f":"IF(ISBLANK(F89)=TRUE,\" \",'2. Metadata'!B$14)","v":"degrees Celsius"},1.94,{"$f":"IF(ISBLANK(H89)=TRUE,\" \",'2. Metadata'!B$26)","v":"degrees Celsius"},2.834,{"$f":"IF(ISBLANK(J89)=TRUE,\" \",'2. Metadata'!B$38)","v":"degrees Celsius"},"n/a"]
["2013-10-31","NECAR01",{"$f":"IF(ISBLANK(B90)=TRUE,\" \", IF(B90='2. Metadata'!B$1,'2. Metadata'!B$5, IF(B90='2. Metadata'!C$1,'2. Metadata'!C$5,IF(B90='2. Metadata'!D$1,'2. Metadata'!D$5, IF(B90='2. Metadata'!E$1,'2. Metadata'!E$5,IF( B90='2. Metadata'!F$1,'2. Metadata'!F$5,IF(B90='2. Metadata'!G$1,'2. Metadata'!G$5,IF(B90='2. Metadata'!H$1,'2. Metadata'!H$5, IF(B90='2. Metadata'!I$1,'2. Metadata'!I$5, IF(B90='2. Metadata'!J$1,'2. Metadata'!J$5, IF(B90='2. Metadata'!K$1,'2. Metadata'!K$5, IF(B90='2. Metadata'!L$1,'2. Metadata'!L$5, IF(B90='2. Metadata'!M$1,'2. Metadata'!M$5, IF(B90='2. Metadata'!N$1,'2. Metadata'!N$5))))))))))))))","v":49.97944},{"$f":"IF(ISBLANK(B90)=TRUE,\" \", IF(B90='2. Metadata'!B$1,'2. Metadata'!B$6, IF(B90='2. Metadata'!C$1,'2. Metadata'!C$6,IF(B90='2. Metadata'!D$1,'2. Metadata'!D$6, IF(B90='2. Metadata'!E$1,'2. Metadata'!E$6,IF( B90='2. Metadata'!F$1,'2. Metadata'!F$6,IF(B90='2. Metadata'!G$1,'2. Metadata'!G$6,IF(B90='2. Metadata'!H$1,'2. Metadata'!H$6, IF(B90='2. Metadata'!I$1,'2. Metadata'!I$6, IF(B90='2. Metadata'!J$1,'2. Metadata'!J$6, IF(B90='2. Metadata'!K$1,'2. Metadata'!K$6, IF(B90='2. Metadata'!L$1,'2. Metadata'!L$6, IF(B90='2. Metadata'!M$1,'2. Metadata'!M$6, IF(B90='2. Metadata'!N$1,'2. Metadata'!N$6))))))))))))))","v":-117.88417},"n/a",4.376,{"$f":"IF(ISBLANK(F90)=TRUE,\" \",'2. Metadata'!B$14)","v":"degrees Celsius"},3.485,{"$f":"IF(ISBLANK(H90)=TRUE,\" \",'2. Metadata'!B$26)","v":"degrees Celsius"},3.894,{"$f":"IF(ISBLANK(J90)=TRUE,\" \",'2. Metadata'!B$38)","v":"degrees Celsius"},"n/a"]
["2013-11-01","NECAR01",{"$f":"IF(ISBLANK(B91)=TRUE,\" \", IF(B91='2. Metadata'!B$1,'2. Metadata'!B$5, IF(B91='2. Metadata'!C$1,'2. Metadata'!C$5,IF(B91='2. Metadata'!D$1,'2. Metadata'!D$5, IF(B91='2. Metadata'!E$1,'2. Metadata'!E$5,IF( B91='2. Metadata'!F$1,'2. Metadata'!F$5,IF(B91='2. Metadata'!G$1,'2. Metadata'!G$5,IF(B91='2. Metadata'!H$1,'2. Metadata'!H$5, IF(B91='2. Metadata'!I$1,'2. Metadata'!I$5, IF(B91='2. Metadata'!J$1,'2. Metadata'!J$5, IF(B91='2. Metadata'!K$1,'2. Metadata'!K$5, IF(B91='2. Metadata'!L$1,'2. Metadata'!L$5, IF(B91='2. Metadata'!M$1,'2. Metadata'!M$5, IF(B91='2. Metadata'!N$1,'2. Metadata'!N$5))))))))))))))","v":49.97944},{"$f":"IF(ISBLANK(B91)=TRUE,\" \", IF(B91='2. Metadata'!B$1,'2. Metadata'!B$6, IF(B91='2. Metadata'!C$1,'2. Metadata'!C$6,IF(B91='2. Metadata'!D$1,'2. Metadata'!D$6, IF(B91='2. Metadata'!E$1,'2. Metadata'!E$6,IF( B91='2. Metadata'!F$1,'2. Metadata'!F$6,IF(B91='2. Metadata'!G$1,'2. Metadata'!G$6,IF(B91='2. Metadata'!H$1,'2. Metadata'!H$6, IF(B91='2. Metadata'!I$1,'2. Metadata'!I$6, IF(B91='2. Metadata'!J$1,'2. Metadata'!J$6, IF(B91='2. Metadata'!K$1,'2. Metadata'!K$6, IF(B91='2. Metadata'!L$1,'2. Metadata'!L$6, IF(B91='2. Metadata'!M$1,'2. Metadata'!M$6, IF(B91='2. Metadata'!N$1,'2. Metadata'!N$6))))))))))))))","v":-117.88417},"n/a",4.454,{"$f":"IF(ISBLANK(F91)=TRUE,\" \",'2. Metadata'!B$14)","v":"degrees Celsius"},3.801,{"$f":"IF(ISBLANK(H91)=TRUE,\" \",'2. Metadata'!B$26)","v":"degrees Celsius"},4.14,{"$f":"IF(ISBLANK(J91)=TRUE,\" \",'2. Metadata'!B$38)","v":"degrees Celsius"},"n/a"]
["2013-11-02","NECAR01",{"$f":"IF(ISBLANK(B92)=TRUE,\" \", IF(B92='2. Metadata'!B$1,'2. Metadata'!B$5, IF(B92='2. Metadata'!C$1,'2. Metadata'!C$5,IF(B92='2. Metadata'!D$1,'2. Metadata'!D$5, IF(B92='2. Metadata'!E$1,'2. Metadata'!E$5,IF( B92='2. Metadata'!F$1,'2. Metadata'!F$5,IF(B92='2. Metadata'!G$1,'2. Metadata'!G$5,IF(B92='2. Metadata'!H$1,'2. Metadata'!H$5, IF(B92='2. Metadata'!I$1,'2. Metadata'!I$5, IF(B92='2. Metadata'!J$1,'2. Metadata'!J$5, IF(B92='2. Metadata'!K$1,'2. Metadata'!K$5, IF(B92='2. Metadata'!L$1,'2. Metadata'!L$5, IF(B92='2. Metadata'!M$1,'2. Metadata'!M$5, IF(B92='2. Metadata'!N$1,'2. Metadata'!N$5))))))))))))))","v":49.97944},{"$f":"IF(ISBLANK(B92)=TRUE,\" \", IF(B92='2. Metadata'!B$1,'2. Metadata'!B$6, IF(B92='2. Metadata'!C$1,'2. Metadata'!C$6,IF(B92='2. Metadata'!D$1,'2. Metadata'!D$6, IF(B92='2. Metadata'!E$1,'2. Metadata'!E$6,IF( B92='2. Metadata'!F$1,'2. Metadata'!F$6,IF(B92='2. Metadata'!G$1,'2. Metadata'!G$6,IF(B92='2. Metadata'!H$1,'2. Metadata'!H$6, IF(B92='2. Metadata'!I$1,'2. Metadata'!I$6, IF(B92='2. Metadata'!J$1,'2. Metadata'!J$6, IF(B92='2. Metadata'!K$1,'2. Metadata'!K$6, IF(B92='2. Metadata'!L$1,'2. Metadata'!L$6, IF(B92='2. Metadata'!M$1,'2. Metadata'!M$6, IF(B92='2. Metadata'!N$1,'2. Metadata'!N$6))))))))))))))","v":-117.88417},"n/a",4.454,{"$f":"IF(ISBLANK(F92)=TRUE,\" \",'2. Metadata'!B$14)","v":"degrees Celsius"},3.538,{"$f":"IF(ISBLANK(H92)=TRUE,\" \",'2. Metadata'!B$26)","v":"degrees Celsius"},3.961,{"$f":"IF(ISBLANK(J92)=TRUE,\" \",'2. Metadata'!B$38)","v":"degrees Celsius"},"n/a"]
["2013-11-03","NECAR01",{"$f":"IF(ISBLANK(B93)=TRUE,\" \", IF(B93='2. Metadata'!B$1,'2. Metadata'!B$5, IF(B93='2. Metadata'!C$1,'2. Metadata'!C$5,IF(B93='2. Metadata'!D$1,'2. Metadata'!D$5, IF(B93='2. Metadata'!E$1,'2. Metadata'!E$5,IF( B93='2. Metadata'!F$1,'2. Metadata'!F$5,IF(B93='2. Metadata'!G$1,'2. Metadata'!G$5,IF(B93='2. Metadata'!H$1,'2. Metadata'!H$5, IF(B93='2. Metadata'!I$1,'2. Metadata'!I$5, IF(B93='2. Metadata'!J$1,'2. Metadata'!J$5, IF(B93='2. Metadata'!K$1,'2. Metadata'!K$5, IF(B93='2. Metadata'!L$1,'2. Metadata'!L$5, IF(B93='2. Metadata'!M$1,'2. Metadata'!M$5, IF(B93='2. Metadata'!N$1,'2. Metadata'!N$5))))))))))))))","v":49.97944},{"$f":"IF(ISBLANK(B93)=TRUE,\" \", IF(B93='2. Metadata'!B$1,'2. Metadata'!B$6, IF(B93='2. Metadata'!C$1,'2. Metadata'!C$6,IF(B93='2. Metadata'!D$1,'2. Metadata'!D$6, IF(B93='2. Metadata'!E$1,'2. Metadata'!E$6,IF( B93='2. Metadata'!F$1,'2. Metadata'!F$6,IF(B93='2. Metadata'!G$1,'2. Metadata'!G$6,IF(B93='2. Metadata'!H$1,'2. Metadata'!H$6, IF(B93='2. Metadata'!I$1,'2. Metadata'!I$6, IF(B93='2. Metadata'!J$1,'2. Metadata'!J$6, IF(B93='2. Metadata'!K$1,'2. Metadata'!K$6, IF(B93='2. Metadata'!L$1,'2. Metadata'!L$6, IF(B93='2. Metadata'!M$1,'2. Metadata'!M$6, IF(B93='2. Metadata'!N$1,'2. Metadata'!N$6))))))))))))))","v":-117.88417},"n/a",4.168,{"$f":"IF(ISBLANK(F93)=TRUE,\" \",'2. Metadata'!B$14)","v":"degrees Celsius"},3.38,{"$f":"IF(ISBLANK(H93)=TRUE,\" \",'2. Metadata'!B$26)","v":"degrees Celsius"},3.662,{"$f":"IF(ISBLANK(J93)=TRUE,\" \",'2. Metadata'!B$38)","v":"degrees Celsius"},"n/a"]
["2013-11-04","NECAR01",{"$f":"IF(ISBLANK(B94)=TRUE,\" \", IF(B94='2. Metadata'!B$1,'2. Metadata'!B$5, IF(B94='2. Metadata'!C$1,'2. Metadata'!C$5,IF(B94='2. Metadata'!D$1,'2. Metadata'!D$5, IF(B94='2. Metadata'!E$1,'2. Metadata'!E$5,IF( B94='2. Metadata'!F$1,'2. Metadata'!F$5,IF(B94='2. Metadata'!G$1,'2. Metadata'!G$5,IF(B94='2. Metadata'!H$1,'2. Metadata'!H$5, IF(B94='2. Metadata'!I$1,'2. Metadata'!I$5, IF(B94='2. Metadata'!J$1,'2. Metadata'!J$5, IF(B94='2. Metadata'!K$1,'2. Metadata'!K$5, IF(B94='2. Metadata'!L$1,'2. Metadata'!L$5, IF(B94='2. Metadata'!M$1,'2. Metadata'!M$5, IF(B94='2. Metadata'!N$1,'2. Metadata'!N$5))))))))))))))","v":49.97944},{"$f":"IF(ISBLANK(B94)=TRUE,\" \", IF(B94='2. Metadata'!B$1,'2. Metadata'!B$6, IF(B94='2. Metadata'!C$1,'2. Metadata'!C$6,IF(B94='2. Metadata'!D$1,'2. Metadata'!D$6, IF(B94='2. Metadata'!E$1,'2. Metadata'!E$6,IF( B94='2. Metadata'!F$1,'2. Metadata'!F$6,IF(B94='2. Metadata'!G$1,'2. Metadata'!G$6,IF(B94='2. Metadata'!H$1,'2. Metadata'!H$6, IF(B94='2. Metadata'!I$1,'2. Metadata'!I$6, IF(B94='2. Metadata'!J$1,'2. Metadata'!J$6, IF(B94='2. Metadata'!K$1,'2. Metadata'!K$6, IF(B94='2. Metadata'!L$1,'2. Metadata'!L$6, IF(B94='2. Metadata'!M$1,'2. Metadata'!M$6, IF(B94='2. Metadata'!N$1,'2. Metadata'!N$6))))))))))))))","v":-117.88417},"n/a",3.696,{"$f":"IF(ISBLANK(F94)=TRUE,\" \",'2. Metadata'!B$14)","v":"degrees Celsius"},2.477,{"$f":"IF(ISBLANK(H94)=TRUE,\" \",'2. Metadata'!B$26)","v":"degrees Celsius"},3.159,{"$f":"IF(ISBLANK(J94)=TRUE,\" \",'2. Metadata'!B$38)","v":"degrees Celsius"},"n/a"]
["2013-11-05","NECAR01",{"$f":"IF(ISBLANK(B95)=TRUE,\" \", IF(B95='2. Metadata'!B$1,'2. Metadata'!B$5, IF(B95='2. Metadata'!C$1,'2. Metadata'!C$5,IF(B95='2. Metadata'!D$1,'2. Metadata'!D$5, IF(B95='2. Metadata'!E$1,'2. Metadata'!E$5,IF( B95='2. Metadata'!F$1,'2. Metadata'!F$5,IF(B95='2. Metadata'!G$1,'2. Metadata'!G$5,IF(B95='2. Metadata'!H$1,'2. Metadata'!H$5, IF(B95='2. Metadata'!I$1,'2. Metadata'!I$5, IF(B95='2. Metadata'!J$1,'2. Metadata'!J$5, IF(B95='2. Metadata'!K$1,'2. Metadata'!K$5, IF(B95='2. Metadata'!L$1,'2. Metadata'!L$5, IF(B95='2. Metadata'!M$1,'2. Metadata'!M$5, IF(B95='2. Metadata'!N$1,'2. Metadata'!N$5))))))))))))))","v":49.97944},{"$f":"IF(ISBLANK(B95)=TRUE,\" \", IF(B95='2. Metadata'!B$1,'2. Metadata'!B$6, IF(B95='2. Metadata'!C$1,'2. Metadata'!C$6,IF(B95='2. Metadata'!D$1,'2. Metadata'!D$6, IF(B95='2. Metadata'!E$1,'2. Metadata'!E$6,IF( B95='2. Metadata'!F$1,'2. Metadata'!F$6,IF(B95='2. Metadata'!G$1,'2. Metadata'!G$6,IF(B95='2. Metadata'!H$1,'2. Metadata'!H$6, IF(B95='2. Metadata'!I$1,'2. Metadata'!I$6, IF(B95='2. Metadata'!J$1,'2. Metadata'!J$6, IF(B95='2. Metadata'!K$1,'2. Metadata'!K$6, IF(B95='2. Metadata'!L$1,'2. Metadata'!L$6, IF(B95='2. Metadata'!M$1,'2. Metadata'!M$6, IF(B95='2. Metadata'!N$1,'2. Metadata'!N$6))))))))))))))","v":-117.88417},"n/a",2.797,{"$f":"IF(ISBLANK(F95)=TRUE,\" \",'2. Metadata'!B$14)","v":"degrees Celsius"},2.209,{"$f":"IF(ISBLANK(H95)=TRUE,\" \",'2. Metadata'!B$26)","v":"degrees Celsius"},2.503,{"$f":"IF(ISBLANK(J95)=TRUE,\" \",'2. Metadata'!B$38)","v":"degrees Celsius"},"n/a"]
["2013-11-06","NECAR01",{"$f":"IF(ISBLANK(B96)=TRUE,\" \", IF(B96='2. Metadata'!B$1,'2. Metadata'!B$5, IF(B96='2. Metadata'!C$1,'2. Metadata'!C$5,IF(B96='2. Metadata'!D$1,'2. Metadata'!D$5, IF(B96='2. Metadata'!E$1,'2. Metadata'!E$5,IF( B96='2. Metadata'!F$1,'2. Metadata'!F$5,IF(B96='2. Metadata'!G$1,'2. Metadata'!G$5,IF(B96='2. Metadata'!H$1,'2. Metadata'!H$5, IF(B96='2. Metadata'!I$1,'2. Metadata'!I$5, IF(B96='2. Metadata'!J$1,'2. Metadata'!J$5, IF(B96='2. Metadata'!K$1,'2. Metadata'!K$5, IF(B96='2. Metadata'!L$1,'2. Metadata'!L$5, IF(B96='2. Metadata'!M$1,'2. Metadata'!M$5, IF(B96='2. Metadata'!N$1,'2. Metadata'!N$5))))))))))))))","v":49.97944},{"$f":"IF(ISBLANK(B96)=TRUE,\" \", IF(B96='2. Metadata'!B$1,'2. Metadata'!B$6, IF(B96='2. Metadata'!C$1,'2. Metadata'!C$6,IF(B96='2. Metadata'!D$1,'2. Metadata'!D$6, IF(B96='2. Metadata'!E$1,'2. Metadata'!E$6,IF( B96='2. Metadata'!F$1,'2. Metadata'!F$6,IF(B96='2. Metadata'!G$1,'2. Metadata'!G$6,IF(B96='2. Metadata'!H$1,'2. Metadata'!H$6, IF(B96='2. Metadata'!I$1,'2. Metadata'!I$6, IF(B96='2. Metadata'!J$1,'2. Metadata'!J$6, IF(B96='2. Metadata'!K$1,'2. Metadata'!K$6, IF(B96='2. Metadata'!L$1,'2. Metadata'!L$6, IF(B96='2. Metadata'!M$1,'2. Metadata'!M$6, IF(B96='2. Metadata'!N$1,'2. Metadata'!N$6))))))))))))))","v":-117.88417},"n/a",3.327,{"$f":"IF(ISBLANK(F96)=TRUE,\" \",'2. Metadata'!B$14)","v":"degrees Celsius"},2.289,{"$f":"IF(ISBLANK(H96)=TRUE,\" \",'2. Metadata'!B$26)","v":"degrees Celsius"},2.793,{"$f":"IF(ISBLANK(J96)=TRUE,\" \",'2. Metadata'!B$38)","v":"degrees Celsius"},"n/a"]
["2013-11-07","NECAR01",{"$f":"IF(ISBLANK(B97)=TRUE,\" \", IF(B97='2. Metadata'!B$1,'2. Metadata'!B$5, IF(B97='2. Metadata'!C$1,'2. Metadata'!C$5,IF(B97='2. Metadata'!D$1,'2. Metadata'!D$5, IF(B97='2. Metadata'!E$1,'2. Metadata'!E$5,IF( B97='2. Metadata'!F$1,'2. Metadata'!F$5,IF(B97='2. Metadata'!G$1,'2. Metadata'!G$5,IF(B97='2. Metadata'!H$1,'2. Metadata'!H$5, IF(B97='2. Metadata'!I$1,'2. Metadata'!I$5, IF(B97='2. Metadata'!J$1,'2. Metadata'!J$5, IF(B97='2. Metadata'!K$1,'2. Metadata'!K$5, IF(B97='2. Metadata'!L$1,'2. Metadata'!L$5, IF(B97='2. Metadata'!M$1,'2. Metadata'!M$5, IF(B97='2. Metadata'!N$1,'2. Metadata'!N$5))))))))))))))","v":49.97944},{"$f":"IF(ISBLANK(B97)=TRUE,\" \", IF(B97='2. Metadata'!B$1,'2. Metadata'!B$6, IF(B97='2. Metadata'!C$1,'2. Metadata'!C$6,IF(B97='2. Metadata'!D$1,'2. Metadata'!D$6, IF(B97='2. Metadata'!E$1,'2. Metadata'!E$6,IF( B97='2. Metadata'!F$1,'2. Metadata'!F$6,IF(B97='2. Metadata'!G$1,'2. Metadata'!G$6,IF(B97='2. Metadata'!H$1,'2. Metadata'!H$6, IF(B97='2. Metadata'!I$1,'2. Metadata'!I$6, IF(B97='2. Metadata'!J$1,'2. Metadata'!J$6, IF(B97='2. Metadata'!K$1,'2. Metadata'!K$6, IF(B97='2. Metadata'!L$1,'2. Metadata'!L$6, IF(B97='2. Metadata'!M$1,'2. Metadata'!M$6, IF(B97='2. Metadata'!N$1,'2. Metadata'!N$6))))))))))))))","v":-117.88417},"n/a",3.142,{"$f":"IF(ISBLANK(F97)=TRUE,\" \",'2. Metadata'!B$14)","v":"degrees Celsius"},2.047,{"$f":"IF(ISBLANK(H97)=TRUE,\" \",'2. Metadata'!B$26)","v":"degrees Celsius"},2.642,{"$f":"IF(ISBLANK(J97)=TRUE,\" \",'2. Metadata'!B$38)","v":"degrees Celsius"},"n/a"]
["2013-11-08","NECAR01",{"$f":"IF(ISBLANK(B98)=TRUE,\" \", IF(B98='2. Metadata'!B$1,'2. Metadata'!B$5, IF(B98='2. Metadata'!C$1,'2. Metadata'!C$5,IF(B98='2. Metadata'!D$1,'2. Metadata'!D$5, IF(B98='2. Metadata'!E$1,'2. Metadata'!E$5,IF( B98='2. Metadata'!F$1,'2. Metadata'!F$5,IF(B98='2. Metadata'!G$1,'2. Metadata'!G$5,IF(B98='2. Metadata'!H$1,'2. Metadata'!H$5, IF(B98='2. Metadata'!I$1,'2. Metadata'!I$5, IF(B98='2. Metadata'!J$1,'2. Metadata'!J$5, IF(B98='2. Metadata'!K$1,'2. Metadata'!K$5, IF(B98='2. Metadata'!L$1,'2. Metadata'!L$5, IF(B98='2. Metadata'!M$1,'2. Metadata'!M$5, IF(B98='2. Metadata'!N$1,'2. Metadata'!N$5))))))))))))))","v":49.97944},{"$f":"IF(ISBLANK(B98)=TRUE,\" \", IF(B98='2. Metadata'!B$1,'2. Metadata'!B$6, IF(B98='2. Metadata'!C$1,'2. Metadata'!C$6,IF(B98='2. Metadata'!D$1,'2. Metadata'!D$6, IF(B98='2. Metadata'!E$1,'2. Metadata'!E$6,IF( B98='2. Metadata'!F$1,'2. Metadata'!F$6,IF(B98='2. Metadata'!G$1,'2. Metadata'!G$6,IF(B98='2. Metadata'!H$1,'2. Metadata'!H$6, IF(B98='2. Metadata'!I$1,'2. Metadata'!I$6, IF(B98='2. Metadata'!J$1,'2. Metadata'!J$6, IF(B98='2. Metadata'!K$1,'2. Metadata'!K$6, IF(B98='2. Metadata'!L$1,'2. Metadata'!L$6, IF(B98='2. Metadata'!M$1,'2. Metadata'!M$6, IF(B98='2. Metadata'!N$1,'2. Metadata'!N$6))))))))))))))","v":-117.88417},"n/a",3.433,{"$f":"IF(ISBLANK(F98)=TRUE,\" \",'2. Metadata'!B$14)","v":"degrees Celsius"},2.289,{"$f":"IF(ISBLANK(H98)=TRUE,\" \",'2. Metadata'!B$26)","v":"degrees Celsius"},2.879,{"$f":"IF(ISBLANK(J98)=TRUE,\" \",'2. Metadata'!B$38)","v":"degrees Celsius"},"n/a"]
["2013-11-09","NECAR01",{"$f":"IF(ISBLANK(B99)=TRUE,\" \", IF(B99='2. Metadata'!B$1,'2. Metadata'!B$5, IF(B99='2. Metadata'!C$1,'2. Metadata'!C$5,IF(B99='2. Metadata'!D$1,'2. Metadata'!D$5, IF(B99='2. Metadata'!E$1,'2. Metadata'!E$5,IF( B99='2. Metadata'!F$1,'2. Metadata'!F$5,IF(B99='2. Metadata'!G$1,'2. Metadata'!G$5,IF(B99='2. Metadata'!H$1,'2. Metadata'!H$5, IF(B99='2. Metadata'!I$1,'2. Metadata'!I$5, IF(B99='2. Metadata'!J$1,'2. Metadata'!J$5, IF(B99='2. Metadata'!K$1,'2. Metadata'!K$5, IF(B99='2. Metadata'!L$1,'2. Metadata'!L$5, IF(B99='2. Metadata'!M$1,'2. Metadata'!M$5, IF(B99='2. Metadata'!N$1,'2. Metadata'!N$5))))))))))))))","v":49.97944},{"$f":"IF(ISBLANK(B99)=TRUE,\" \", IF(B99='2. Metadata'!B$1,'2. Metadata'!B$6, IF(B99='2. Metadata'!C$1,'2. Metadata'!C$6,IF(B99='2. Metadata'!D$1,'2. Metadata'!D$6, IF(B99='2. Metadata'!E$1,'2. Metadata'!E$6,IF( B99='2. Metadata'!F$1,'2. Metadata'!F$6,IF(B99='2. Metadata'!G$1,'2. Metadata'!G$6,IF(B99='2. Metadata'!H$1,'2. Metadata'!H$6, IF(B99='2. Metadata'!I$1,'2. Metadata'!I$6, IF(B99='2. Metadata'!J$1,'2. Metadata'!J$6, IF(B99='2. Metadata'!K$1,'2. Metadata'!K$6, IF(B99='2. Metadata'!L$1,'2. Metadata'!L$6, IF(B99='2. Metadata'!M$1,'2. Metadata'!M$6, IF(B99='2. Metadata'!N$1,'2. Metadata'!N$6))))))))))))))","v":-117.88417},"n/a",4.011,{"$f":"IF(ISBLANK(F99)=TRUE,\" \",'2. Metadata'!B$14)","v":"degrees Celsius"},2.664,{"$f":"IF(ISBLANK(H99)=TRUE,\" \",'2. Metadata'!B$26)","v":"degrees Celsius"},3.292,{"$f":"IF(ISBLANK(J99)=TRUE,\" \",'2. Metadata'!B$38)","v":"degrees Celsius"},"n/a"]
["2013-11-10","NECAR01",{"$f":"IF(ISBLANK(B100)=TRUE,\" \", IF(B100='2. Metadata'!B$1,'2. Metadata'!B$5, IF(B100='2. Metadata'!C$1,'2. Metadata'!C$5,IF(B100='2. Metadata'!D$1,'2. Metadata'!D$5, IF(B100='2. Metadata'!E$1,'2. Metadata'!E$5,IF( B100='2. Metadata'!F$1,'2. Metadata'!F$5,IF(B100='2. Metadata'!G$1,'2. Metadata'!G$5,IF(B100='2. Metadata'!H$1,'2. Metadata'!H$5, IF(B100='2. Metadata'!I$1,'2. Metadata'!I$5, IF(B100='2. Metadata'!J$1,'2. Metadata'!J$5, IF(B100='2. Metadata'!K$1,'2. Metadata'!K$5, IF(B100='2. Metadata'!L$1,'2. Metadata'!L$5, IF(B100='2. Metadata'!M$1,'2. Metadata'!M$5, IF(B100='2. Metadata'!N$1,'2. Metadata'!N$5))))))))))))))","v":49.97944},{"$f":"IF(ISBLANK(B100)=TRUE,\" \", IF(B100='2. Metadata'!B$1,'2. Metadata'!B$6, IF(B100='2. Metadata'!C$1,'2. Metadata'!C$6,IF(B100='2. Metadata'!D$1,'2. Metadata'!D$6, IF(B100='2. Metadata'!E$1,'2. Metadata'!E$6,IF( B100='2. Metadata'!F$1,'2. Metadata'!F$6,IF(B100='2. Metadata'!G$1,'2. Metadata'!G$6,IF(B100='2. Metadata'!H$1,'2. Metadata'!H$6, IF(B100='2. Metadata'!I$1,'2. Metadata'!I$6, IF(B100='2. Metadata'!J$1,'2. Metadata'!J$6, IF(B100='2. Metadata'!K$1,'2. Metadata'!K$6, IF(B100='2. Metadata'!L$1,'2. Metadata'!L$6, IF(B100='2. Metadata'!M$1,'2. Metadata'!M$6, IF(B100='2. Metadata'!N$1,'2. Metadata'!N$6))))))))))))))","v":-117.88417},"n/a",3.958,{"$f":"IF(ISBLANK(F100)=TRUE,\" \",'2. Metadata'!B$14)","v":"degrees Celsius"},3.195,{"$f":"IF(ISBLANK(H100)=TRUE,\" \",'2. Metadata'!B$26)","v":"degrees Celsius"},3.548,{"$f":"IF(ISBLANK(J100)=TRUE,\" \",'2. Metadata'!B$38)","v":"degrees Celsius"},"n/a"]
["2013-11-11","NECAR01",{"$f":"IF(ISBLANK(B101)=TRUE,\" \", IF(B101='2. Metadata'!B$1,'2. Metadata'!B$5, IF(B101='2. Metadata'!C$1,'2. Metadata'!C$5,IF(B101='2. Metadata'!D$1,'2. Metadata'!D$5, IF(B101='2. Metadata'!E$1,'2. Metadata'!E$5,IF( B101='2. Metadata'!F$1,'2. Metadata'!F$5,IF(B101='2. Metadata'!G$1,'2. Metadata'!G$5,IF(B101='2. Metadata'!H$1,'2. Metadata'!H$5, IF(B101='2. Metadata'!I$1,'2. Metadata'!I$5, IF(B101='2. Metadata'!J$1,'2. Metadata'!J$5, IF(B101='2. Metadata'!K$1,'2. Metadata'!K$5, IF(B101='2. Metadata'!L$1,'2. Metadata'!L$5, IF(B101='2. Metadata'!M$1,'2. Metadata'!M$5, IF(B101='2. Metadata'!N$1,'2. Metadata'!N$5))))))))))))))","v":49.97944},{"$f":"IF(ISBLANK(B101)=TRUE,\" \", IF(B101='2. Metadata'!B$1,'2. Metadata'!B$6, IF(B101='2. Metadata'!C$1,'2. Metadata'!C$6,IF(B101='2. Metadata'!D$1,'2. Metadata'!D$6, IF(B101='2. Metadata'!E$1,'2. Metadata'!E$6,IF( B101='2. Metadata'!F$1,'2. Metadata'!F$6,IF(B101='2. Metadata'!G$1,'2. Metadata'!G$6,IF(B101='2. Metadata'!H$1,'2. Metadata'!H$6, IF(B101='2. Metadata'!I$1,'2. Metadata'!I$6, IF(B101='2. Metadata'!J$1,'2. Metadata'!J$6, IF(B101='2. Metadata'!K$1,'2. Metadata'!K$6, IF(B101='2. Metadata'!L$1,'2. Metadata'!L$6, IF(B101='2. Metadata'!M$1,'2. Metadata'!M$6, IF(B101='2. Metadata'!N$1,'2. Metadata'!N$6))))))))))))))","v":-117.88417},"n/a",4.194,{"$f":"IF(ISBLANK(F101)=TRUE,\" \",'2. Metadata'!B$14)","v":"degrees Celsius"},3.406,{"$f":"IF(ISBLANK(H101)=TRUE,\" \",'2. Metadata'!B$26)","v":"degrees Celsius"},3.666,{"$f":"IF(ISBLANK(J101)=TRUE,\" \",'2. Metadata'!B$38)","v":"degrees Celsius"},"n/a"]
["2013-11-12","NECAR01",{"$f":"IF(ISBLANK(B102)=TRUE,\" \", IF(B102='2. Metadata'!B$1,'2. Metadata'!B$5, IF(B102='2. Metadata'!C$1,'2. Metadata'!C$5,IF(B102='2. Metadata'!D$1,'2. Metadata'!D$5, IF(B102='2. Metadata'!E$1,'2. Metadata'!E$5,IF( B102='2. Metadata'!F$1,'2. Metadata'!F$5,IF(B102='2. Metadata'!G$1,'2. Metadata'!G$5,IF(B102='2. Metadata'!H$1,'2. Metadata'!H$5, IF(B102='2. Metadata'!I$1,'2. Metadata'!I$5, IF(B102='2. Metadata'!J$1,'2. Metadata'!J$5, IF(B102='2. Metadata'!K$1,'2. Metadata'!K$5, IF(B102='2. Metadata'!L$1,'2. Metadata'!L$5, IF(B102='2. Metadata'!M$1,'2. Metadata'!M$5, IF(B102='2. Metadata'!N$1,'2. Metadata'!N$5))))))))))))))","v":49.97944},{"$f":"IF(ISBLANK(B102)=TRUE,\" \", IF(B102='2. Metadata'!B$1,'2. Metadata'!B$6, IF(B102='2. Metadata'!C$1,'2. Metadata'!C$6,IF(B102='2. Metadata'!D$1,'2. Metadata'!D$6, IF(B102='2. Metadata'!E$1,'2. Metadata'!E$6,IF( B102='2. Metadata'!F$1,'2. Metadata'!F$6,IF(B102='2. Metadata'!G$1,'2. Metadata'!G$6,IF(B102='2. Metadata'!H$1,'2. Metadata'!H$6, IF(B102='2. Metadata'!I$1,'2. Metadata'!I$6, IF(B102='2. Metadata'!J$1,'2. Metadata'!J$6, IF(B102='2. Metadata'!K$1,'2. Metadata'!K$6, IF(B102='2. Metadata'!L$1,'2. Metadata'!L$6, IF(B102='2. Metadata'!M$1,'2. Metadata'!M$6, IF(B102='2. Metadata'!N$1,'2. Metadata'!N$6))))))))))))))","v":-117.88417},"n/a",3.643,{"$f":"IF(ISBLANK(F102)=TRUE,\" \",'2. Metadata'!B$14)","v":"degrees Celsius"},3.116,{"$f":"IF(ISBLANK(H102)=TRUE,\" \",'2. Metadata'!B$26)","v":"degrees Celsius"},3.373,{"$f":"IF(ISBLANK(J102)=TRUE,\" \",'2. Metadata'!B$38)","v":"degrees Celsius"},"n/a"]
["2013-11-13","NECAR01",{"$f":"IF(ISBLANK(B103)=TRUE,\" \", IF(B103='2. Metadata'!B$1,'2. Metadata'!B$5, IF(B103='2. Metadata'!C$1,'2. Metadata'!C$5,IF(B103='2. Metadata'!D$1,'2. Metadata'!D$5, IF(B103='2. Metadata'!E$1,'2. Metadata'!E$5,IF( B103='2. Metadata'!F$1,'2. Metadata'!F$5,IF(B103='2. Metadata'!G$1,'2. Metadata'!G$5,IF(B103='2. Metadata'!H$1,'2. Metadata'!H$5, IF(B103='2. Metadata'!I$1,'2. Metadata'!I$5, IF(B103='2. Metadata'!J$1,'2. Metadata'!J$5, IF(B103='2. Metadata'!K$1,'2. Metadata'!K$5, IF(B103='2. Metadata'!L$1,'2. Metadata'!L$5, IF(B103='2. Metadata'!M$1,'2. Metadata'!M$5, IF(B103='2. Metadata'!N$1,'2. Metadata'!N$5))))))))))))))","v":49.97944},{"$f":"IF(ISBLANK(B103)=TRUE,\" \", IF(B103='2. Metadata'!B$1,'2. Metadata'!B$6, IF(B103='2. Metadata'!C$1,'2. Metadata'!C$6,IF(B103='2. Metadata'!D$1,'2. Metadata'!D$6, IF(B103='2. Metadata'!E$1,'2. Metadata'!E$6,IF( B103='2. Metadata'!F$1,'2. Metadata'!F$6,IF(B103='2. Metadata'!G$1,'2. Metadata'!G$6,IF(B103='2. Metadata'!H$1,'2. Metadata'!H$6, IF(B103='2. Metadata'!I$1,'2. Metadata'!I$6, IF(B103='2. Metadata'!J$1,'2. Metadata'!J$6, IF(B103='2. Metadata'!K$1,'2. Metadata'!K$6, IF(B103='2. Metadata'!L$1,'2. Metadata'!L$6, IF(B103='2. Metadata'!M$1,'2. Metadata'!M$6, IF(B103='2. Metadata'!N$1,'2. Metadata'!N$6))))))))))))))","v":-117.88417},"n/a",4.141,{"$f":"IF(ISBLANK(F103)=TRUE,\" \",'2. Metadata'!B$14)","v":"degrees Celsius"},3.433,{"$f":"IF(ISBLANK(H103)=TRUE,\" \",'2. Metadata'!B$26)","v":"degrees Celsius"},3.793,{"$f":"IF(ISBLANK(J103)=TRUE,\" \",'2. Metadata'!B$38)","v":"degrees Celsius"},"n/a"]
["2013-11-14","NECAR01",{"$f":"IF(ISBLANK(B104)=TRUE,\" \", IF(B104='2. Metadata'!B$1,'2. Metadata'!B$5, IF(B104='2. Metadata'!C$1,'2. Metadata'!C$5,IF(B104='2. Metadata'!D$1,'2. Metadata'!D$5, IF(B104='2. Metadata'!E$1,'2. Metadata'!E$5,IF( B104='2. Metadata'!F$1,'2. Metadata'!F$5,IF(B104='2. Metadata'!G$1,'2. Metadata'!G$5,IF(B104='2. Metadata'!H$1,'2. Metadata'!H$5, IF(B104='2. Metadata'!I$1,'2. Metadata'!I$5, IF(B104='2. Metadata'!J$1,'2. Metadata'!J$5, IF(B104='2. Metadata'!K$1,'2. Metadata'!K$5, IF(B104='2. Metadata'!L$1,'2. Metadata'!L$5, IF(B104='2. Metadata'!M$1,'2. Metadata'!M$5, IF(B104='2. Metadata'!N$1,'2. Metadata'!N$5))))))))))))))","v":49.97944},{"$f":"IF(ISBLANK(B104)=TRUE,\" \", IF(B104='2. Metadata'!B$1,'2. Metadata'!B$6, IF(B104='2. Metadata'!C$1,'2. Metadata'!C$6,IF(B104='2. Metadata'!D$1,'2. Metadata'!D$6, IF(B104='2. Metadata'!E$1,'2. Metadata'!E$6,IF( B104='2. Metadata'!F$1,'2. Metadata'!F$6,IF(B104='2. Metadata'!G$1,'2. Metadata'!G$6,IF(B104='2. Metadata'!H$1,'2. Metadata'!H$6, IF(B104='2. Metadata'!I$1,'2. Metadata'!I$6, IF(B104='2. Metadata'!J$1,'2. Metadata'!J$6, IF(B104='2. Metadata'!K$1,'2. Metadata'!K$6, IF(B104='2. Metadata'!L$1,'2. Metadata'!L$6, IF(B104='2. Metadata'!M$1,'2. Metadata'!M$6, IF(B104='2. Metadata'!N$1,'2. Metadata'!N$6))))))))))))))","v":-117.88417},"n/a",4.298,{"$f":"IF(ISBLANK(F104)=TRUE,\" \",'2. Metadata'!B$14)","v":"degrees Celsius"},3.538,{"$f":"IF(ISBLANK(H104)=TRUE,\" \",'2. Metadata'!B$26)","v":"degrees Celsius"},3.884,{"$f":"IF(ISBLANK(J104)=TRUE,\" \",'2. Metadata'!B$38)","v":"degrees Celsius"},"n/a"]
["2013-11-15","NECAR01",{"$f":"IF(ISBLANK(B105)=TRUE,\" \", IF(B105='2. Metadata'!B$1,'2. Metadata'!B$5, IF(B105='2. Metadata'!C$1,'2. Metadata'!C$5,IF(B105='2. Metadata'!D$1,'2. Metadata'!D$5, IF(B105='2. Metadata'!E$1,'2. Metadata'!E$5,IF( B105='2. Metadata'!F$1,'2. Metadata'!F$5,IF(B105='2. Metadata'!G$1,'2. Metadata'!G$5,IF(B105='2. Metadata'!H$1,'2. Metadata'!H$5, IF(B105='2. Metadata'!I$1,'2. Metadata'!I$5, IF(B105='2. Metadata'!J$1,'2. Metadata'!J$5, IF(B105='2. Metadata'!K$1,'2. Metadata'!K$5, IF(B105='2. Metadata'!L$1,'2. Metadata'!L$5, IF(B105='2. Metadata'!M$1,'2. Metadata'!M$5, IF(B105='2. Metadata'!N$1,'2. Metadata'!N$5))))))))))))))","v":49.97944},{"$f":"IF(ISBLANK(B105)=TRUE,\" \", IF(B105='2. Metadata'!B$1,'2. Metadata'!B$6, IF(B105='2. Metadata'!C$1,'2. Metadata'!C$6,IF(B105='2. Metadata'!D$1,'2. Metadata'!D$6, IF(B105='2. Metadata'!E$1,'2. Metadata'!E$6,IF( B105='2. Metadata'!F$1,'2. Metadata'!F$6,IF(B105='2. Metadata'!G$1,'2. Metadata'!G$6,IF(B105='2. Metadata'!H$1,'2. Metadata'!H$6, IF(B105='2. Metadata'!I$1,'2. Metadata'!I$6, IF(B105='2. Metadata'!J$1,'2. Metadata'!J$6, IF(B105='2. Metadata'!K$1,'2. Metadata'!K$6, IF(B105='2. Metadata'!L$1,'2. Metadata'!L$6, IF(B105='2. Metadata'!M$1,'2. Metadata'!M$6, IF(B105='2. Metadata'!N$1,'2. Metadata'!N$6))))))))))))))","v":-117.88417},"n/a",3.643,{"$f":"IF(ISBLANK(F105)=TRUE,\" \",'2. Metadata'!B$14)","v":"degrees Celsius"},3.009,{"$f":"IF(ISBLANK(H105)=TRUE,\" \",'2. Metadata'!B$26)","v":"degrees Celsius"},3.442,{"$f":"IF(ISBLANK(J105)=TRUE,\" \",'2. Metadata'!B$38)","v":"degrees Celsius"},"n/a"]
["2013-11-16","NECAR01",{"$f":"IF(ISBLANK(B106)=TRUE,\" \", IF(B106='2. Metadata'!B$1,'2. Metadata'!B$5, IF(B106='2. Metadata'!C$1,'2. Metadata'!C$5,IF(B106='2. Metadata'!D$1,'2. Metadata'!D$5, IF(B106='2. Metadata'!E$1,'2. Metadata'!E$5,IF( B106='2. Metadata'!F$1,'2. Metadata'!F$5,IF(B106='2. Metadata'!G$1,'2. Metadata'!G$5,IF(B106='2. Metadata'!H$1,'2. Metadata'!H$5, IF(B106='2. Metadata'!I$1,'2. Metadata'!I$5, IF(B106='2. Metadata'!J$1,'2. Metadata'!J$5, IF(B106='2. Metadata'!K$1,'2. Metadata'!K$5, IF(B106='2. Metadata'!L$1,'2. Metadata'!L$5, IF(B106='2. Metadata'!M$1,'2. Metadata'!M$5, IF(B106='2. Metadata'!N$1,'2. Metadata'!N$5))))))))))))))","v":49.97944},{"$f":"IF(ISBLANK(B106)=TRUE,\" \", IF(B106='2. Metadata'!B$1,'2. Metadata'!B$6, IF(B106='2. Metadata'!C$1,'2. Metadata'!C$6,IF(B106='2. Metadata'!D$1,'2. Metadata'!D$6, IF(B106='2. Metadata'!E$1,'2. Metadata'!E$6,IF( B106='2. Metadata'!F$1,'2. Metadata'!F$6,IF(B106='2. Metadata'!G$1,'2. Metadata'!G$6,IF(B106='2. Metadata'!H$1,'2. Metadata'!H$6, IF(B106='2. Metadata'!I$1,'2. Metadata'!I$6, IF(B106='2. Metadata'!J$1,'2. Metadata'!J$6, IF(B106='2. Metadata'!K$1,'2. Metadata'!K$6, IF(B106='2. Metadata'!L$1,'2. Metadata'!L$6, IF(B106='2. Metadata'!M$1,'2. Metadata'!M$6, IF(B106='2. Metadata'!N$1,'2. Metadata'!N$6))))))))))))))","v":-117.88417},"n/a",3.168,{"$f":"IF(ISBLANK(F106)=TRUE,\" \",'2. Metadata'!B$14)","v":"degrees Celsius"},2.37,{"$f":"IF(ISBLANK(H106)=TRUE,\" \",'2. Metadata'!B$26)","v":"degrees Celsius"},2.685,{"$f":"IF(ISBLANK(J106)=TRUE,\" \",'2. Metadata'!B$38)","v":"degrees Celsius"},"n/a"]
["2013-11-17","NECAR01",{"$f":"IF(ISBLANK(B107)=TRUE,\" \", IF(B107='2. Metadata'!B$1,'2. Metadata'!B$5, IF(B107='2. Metadata'!C$1,'2. Metadata'!C$5,IF(B107='2. Metadata'!D$1,'2. Metadata'!D$5, IF(B107='2. Metadata'!E$1,'2. Metadata'!E$5,IF( B107='2. Metadata'!F$1,'2. Metadata'!F$5,IF(B107='2. Metadata'!G$1,'2. Metadata'!G$5,IF(B107='2. Metadata'!H$1,'2. Metadata'!H$5, IF(B107='2. Metadata'!I$1,'2. Metadata'!I$5, IF(B107='2. Metadata'!J$1,'2. Metadata'!J$5, IF(B107='2. Metadata'!K$1,'2. Metadata'!K$5, IF(B107='2. Metadata'!L$1,'2. Metadata'!L$5, IF(B107='2. Metadata'!M$1,'2. Metadata'!M$5, IF(B107='2. Metadata'!N$1,'2. Metadata'!N$5))))))))))))))","v":49.97944},{"$f":"IF(ISBLANK(B107)=TRUE,\" \", IF(B107='2. Metadata'!B$1,'2. Metadata'!B$6, IF(B107='2. Metadata'!C$1,'2. Metadata'!C$6,IF(B107='2. Metadata'!D$1,'2. Metadata'!D$6, IF(B107='2. Metadata'!E$1,'2. Metadata'!E$6,IF( B107='2. Metadata'!F$1,'2. Metadata'!F$6,IF(B107='2. Metadata'!G$1,'2. Metadata'!G$6,IF(B107='2. Metadata'!H$1,'2. Metadata'!H$6, IF(B107='2. Metadata'!I$1,'2. Metadata'!I$6, IF(B107='2. Metadata'!J$1,'2. Metadata'!J$6, IF(B107='2. Metadata'!K$1,'2. Metadata'!K$6, IF(B107='2. Metadata'!L$1,'2. Metadata'!L$6, IF(B107='2. Metadata'!M$1,'2. Metadata'!M$6, IF(B107='2. Metadata'!N$1,'2. Metadata'!N$6))))))))))))))","v":-117.88417},"n/a",2.53,{"$f":"IF(ISBLANK(F107)=TRUE,\" \",'2. Metadata'!B$14)","v":"degrees Celsius"},1.967,{"$f":"IF(ISBLANK(H107)=TRUE,\" \",'2. Metadata'!B$26)","v":"degrees Celsius"},2.256,{"$f":"IF(ISBLANK(J107)=TRUE,\" \",'2. Metadata'!B$38)","v":"degrees Celsius"},"n/a"]
["2013-11-18","NECAR01",{"$f":"IF(ISBLANK(B108)=TRUE,\" \", IF(B108='2. Metadata'!B$1,'2. Metadata'!B$5, IF(B108='2. Metadata'!C$1,'2. Metadata'!C$5,IF(B108='2. Metadata'!D$1,'2. Metadata'!D$5, IF(B108='2. Metadata'!E$1,'2. Metadata'!E$5,IF( B108='2. Metadata'!F$1,'2. Metadata'!F$5,IF(B108='2. Metadata'!G$1,'2. Metadata'!G$5,IF(B108='2. Metadata'!H$1,'2. Metadata'!H$5, IF(B108='2. Metadata'!I$1,'2. Metadata'!I$5, IF(B108='2. Metadata'!J$1,'2. Metadata'!J$5, IF(B108='2. Metadata'!K$1,'2. Metadata'!K$5, IF(B108='2. Metadata'!L$1,'2. Metadata'!L$5, IF(B108='2. Metadata'!M$1,'2. Metadata'!M$5, IF(B108='2. Metadata'!N$1,'2. Metadata'!N$5))))))))))))))","v":49.97944},{"$f":"IF(ISBLANK(B108)=TRUE,\" \", IF(B108='2. Metadata'!B$1,'2. Metadata'!B$6, IF(B108='2. Metadata'!C$1,'2. Metadata'!C$6,IF(B108='2. Metadata'!D$1,'2. Metadata'!D$6, IF(B108='2. Metadata'!E$1,'2. Metadata'!E$6,IF( B108='2. Metadata'!F$1,'2. Metadata'!F$6,IF(B108='2. Metadata'!G$1,'2. Metadata'!G$6,IF(B108='2. Metadata'!H$1,'2. Metadata'!H$6, IF(B108='2. Metadata'!I$1,'2. Metadata'!I$6, IF(B108='2. Metadata'!J$1,'2. Metadata'!J$6, IF(B108='2. Metadata'!K$1,'2. Metadata'!K$6, IF(B108='2. Metadata'!L$1,'2. Metadata'!L$6, IF(B108='2. Metadata'!M$1,'2. Metadata'!M$6, IF(B108='2. Metadata'!N$1,'2. Metadata'!N$6))))))))))))))","v":-117.88417},"n/a",2.93,{"$f":"IF(ISBLANK(F108)=TRUE,\" \",'2. Metadata'!B$14)","v":"degrees Celsius"},2.289,{"$f":"IF(ISBLANK(H108)=TRUE,\" \",'2. Metadata'!B$26)","v":"degrees Celsius"},2.641,{"$f":"IF(ISBLANK(J108)=TRUE,\" \",'2. Metadata'!B$38)","v":"degrees Celsius"},"n/a"]
["2013-11-19","NECAR01",{"$f":"IF(ISBLANK(B109)=TRUE,\" \", IF(B109='2. Metadata'!B$1,'2. Metadata'!B$5, IF(B109='2. Metadata'!C$1,'2. Metadata'!C$5,IF(B109='2. Metadata'!D$1,'2. Metadata'!D$5, IF(B109='2. Metadata'!E$1,'2. Metadata'!E$5,IF( B109='2. Metadata'!F$1,'2. Metadata'!F$5,IF(B109='2. Metadata'!G$1,'2. Metadata'!G$5,IF(B109='2. Metadata'!H$1,'2. Metadata'!H$5, IF(B109='2. Metadata'!I$1,'2. Metadata'!I$5, IF(B109='2. Metadata'!J$1,'2. Metadata'!J$5, IF(B109='2. Metadata'!K$1,'2. Metadata'!K$5, IF(B109='2. Metadata'!L$1,'2. Metadata'!L$5, IF(B109='2. Metadata'!M$1,'2. Metadata'!M$5, IF(B109='2. Metadata'!N$1,'2. Metadata'!N$5))))))))))))))","v":49.97944},{"$f":"IF(ISBLANK(B109)=TRUE,\" \", IF(B109='2. Metadata'!B$1,'2. Metadata'!B$6, IF(B109='2. Metadata'!C$1,'2. Metadata'!C$6,IF(B109='2. Metadata'!D$1,'2. Metadata'!D$6, IF(B109='2. Metadata'!E$1,'2. Metadata'!E$6,IF( B109='2. Metadata'!F$1,'2. Metadata'!F$6,IF(B109='2. Metadata'!G$1,'2. Metadata'!G$6,IF(B109='2. Metadata'!H$1,'2. Metadata'!H$6, IF(B109='2. Metadata'!I$1,'2. Metadata'!I$6, IF(B109='2. Metadata'!J$1,'2. Metadata'!J$6, IF(B109='2. Metadata'!K$1,'2. Metadata'!K$6, IF(B109='2. Metadata'!L$1,'2. Metadata'!L$6, IF(B109='2. Metadata'!M$1,'2. Metadata'!M$6, IF(B109='2. Metadata'!N$1,'2. Metadata'!N$6))))))))))))))","v":-117.88417},"n/a",3.538,{"$f":"IF(ISBLANK(F109)=TRUE,\" \",'2. Metadata'!B$14)","v":"degrees Celsius"},2.37,{"$f":"IF(ISBLANK(H109)=TRUE,\" \",'2. Metadata'!B$26)","v":"degrees Celsius"},3.061,{"$f":"IF(ISBLANK(J109)=TRUE,\" \",'2. Metadata'!B$38)","v":"degrees Celsius"},"n/a"]
["2013-11-20","NECAR01",{"$f":"IF(ISBLANK(B110)=TRUE,\" \", IF(B110='2. Metadata'!B$1,'2. Metadata'!B$5, IF(B110='2. Metadata'!C$1,'2. Metadata'!C$5,IF(B110='2. Metadata'!D$1,'2. Metadata'!D$5, IF(B110='2. Metadata'!E$1,'2. Metadata'!E$5,IF( B110='2. Metadata'!F$1,'2. Metadata'!F$5,IF(B110='2. Metadata'!G$1,'2. Metadata'!G$5,IF(B110='2. Metadata'!H$1,'2. Metadata'!H$5, IF(B110='2. Metadata'!I$1,'2. Metadata'!I$5, IF(B110='2. Metadata'!J$1,'2. Metadata'!J$5, IF(B110='2. Metadata'!K$1,'2. Metadata'!K$5, IF(B110='2. Metadata'!L$1,'2. Metadata'!L$5, IF(B110='2. Metadata'!M$1,'2. Metadata'!M$5, IF(B110='2. Metadata'!N$1,'2. Metadata'!N$5))))))))))))))","v":49.97944},{"$f":"IF(ISBLANK(B110)=TRUE,\" \", IF(B110='2. Metadata'!B$1,'2. Metadata'!B$6, IF(B110='2. Metadata'!C$1,'2. Metadata'!C$6,IF(B110='2. Metadata'!D$1,'2. Metadata'!D$6, IF(B110='2. Metadata'!E$1,'2. Metadata'!E$6,IF( B110='2. Metadata'!F$1,'2. Metadata'!F$6,IF(B110='2. Metadata'!G$1,'2. Metadata'!G$6,IF(B110='2. Metadata'!H$1,'2. Metadata'!H$6, IF(B110='2. Metadata'!I$1,'2. Metadata'!I$6, IF(B110='2. Metadata'!J$1,'2. Metadata'!J$6, IF(B110='2. Metadata'!K$1,'2. Metadata'!K$6, IF(B110='2. Metadata'!L$1,'2. Metadata'!L$6, IF(B110='2. Metadata'!M$1,'2. Metadata'!M$6, IF(B110='2. Metadata'!N$1,'2. Metadata'!N$6))))))))))))))","v":-117.88417},"n/a",2.155,{"$f":"IF(ISBLANK(F110)=TRUE,\" \",'2. Metadata'!B$14)","v":"degrees Celsius"},-0.032,{"$f":"IF(ISBLANK(H110)=TRUE,\" \",'2. Metadata'!B$26)","v":"degrees Celsius"},0.555,{"$f":"IF(ISBLANK(J110)=TRUE,\" \",'2. Metadata'!B$38)","v":"degrees Celsius"},"n/a"]
["2013-11-21","NECAR01",{"$f":"IF(ISBLANK(B111)=TRUE,\" \", IF(B111='2. Metadata'!B$1,'2. Metadata'!B$5, IF(B111='2. Metadata'!C$1,'2. Metadata'!C$5,IF(B111='2. Metadata'!D$1,'2. Metadata'!D$5, IF(B111='2. Metadata'!E$1,'2. Metadata'!E$5,IF( B111='2. Metadata'!F$1,'2. Metadata'!F$5,IF(B111='2. Metadata'!G$1,'2. Metadata'!G$5,IF(B111='2. Metadata'!H$1,'2. Metadata'!H$5, IF(B111='2. Metadata'!I$1,'2. Metadata'!I$5, IF(B111='2. Metadata'!J$1,'2. Metadata'!J$5, IF(B111='2. Metadata'!K$1,'2. Metadata'!K$5, IF(B111='2. Metadata'!L$1,'2. Metadata'!L$5, IF(B111='2. Metadata'!M$1,'2. Metadata'!M$5, IF(B111='2. Metadata'!N$1,'2. Metadata'!N$5))))))))))))))","v":49.97944},{"$f":"IF(ISBLANK(B111)=TRUE,\" \", IF(B111='2. Metadata'!B$1,'2. Metadata'!B$6, IF(B111='2. Metadata'!C$1,'2. Metadata'!C$6,IF(B111='2. Metadata'!D$1,'2. Metadata'!D$6, IF(B111='2. Metadata'!E$1,'2. Metadata'!E$6,IF( B111='2. Metadata'!F$1,'2. Metadata'!F$6,IF(B111='2. Metadata'!G$1,'2. Metadata'!G$6,IF(B111='2. Metadata'!H$1,'2. Metadata'!H$6, IF(B111='2. Metadata'!I$1,'2. Metadata'!I$6, IF(B111='2. Metadata'!J$1,'2. Metadata'!J$6, IF(B111='2. Metadata'!K$1,'2. Metadata'!K$6, IF(B111='2. Metadata'!L$1,'2. Metadata'!L$6, IF(B111='2. Metadata'!M$1,'2. Metadata'!M$6, IF(B111='2. Metadata'!N$1,'2. Metadata'!N$6))))))))))))))","v":-117.88417},"n/a",0.024,{"$f":"IF(ISBLANK(F111)=TRUE,\" \",'2. Metadata'!B$14)","v":"degrees Celsius"},-0.032,{"$f":"IF(ISBLANK(H111)=TRUE,\" \",'2. Metadata'!B$26)","v":"degrees Celsius"},-0.007,{"$f":"IF(ISBLANK(J111)=TRUE,\" \",'2. Metadata'!B$38)","v":"degrees Celsius"},"n/a"]
["2013-11-22","NECAR01",{"$f":"IF(ISBLANK(B112)=TRUE,\" \", IF(B112='2. Metadata'!B$1,'2. Metadata'!B$5, IF(B112='2. Metadata'!C$1,'2. Metadata'!C$5,IF(B112='2. Metadata'!D$1,'2. Metadata'!D$5, IF(B112='2. Metadata'!E$1,'2. Metadata'!E$5,IF( B112='2. Metadata'!F$1,'2. Metadata'!F$5,IF(B112='2. Metadata'!G$1,'2. Metadata'!G$5,IF(B112='2. Metadata'!H$1,'2. Metadata'!H$5, IF(B112='2. Metadata'!I$1,'2. Metadata'!I$5, IF(B112='2. Metadata'!J$1,'2. Metadata'!J$5, IF(B112='2. Metadata'!K$1,'2. Metadata'!K$5, IF(B112='2. Metadata'!L$1,'2. Metadata'!L$5, IF(B112='2. Metadata'!M$1,'2. Metadata'!M$5, IF(B112='2. Metadata'!N$1,'2. Metadata'!N$5))))))))))))))","v":49.97944},{"$f":"IF(ISBLANK(B112)=TRUE,\" \", IF(B112='2. Metadata'!B$1,'2. Metadata'!B$6, IF(B112='2. Metadata'!C$1,'2. Metadata'!C$6,IF(B112='2. Metadata'!D$1,'2. Metadata'!D$6, IF(B112='2. Metadata'!E$1,'2. Metadata'!E$6,IF( B112='2. Metadata'!F$1,'2. Metadata'!F$6,IF(B112='2. Metadata'!G$1,'2. Metadata'!G$6,IF(B112='2. Metadata'!H$1,'2. Metadata'!H$6, IF(B112='2. Metadata'!I$1,'2. Metadata'!I$6, IF(B112='2. Metadata'!J$1,'2. Metadata'!J$6, IF(B112='2. Metadata'!K$1,'2. Metadata'!K$6, IF(B112='2. Metadata'!L$1,'2. Metadata'!L$6, IF(B112='2. Metadata'!M$1,'2. Metadata'!M$6, IF(B112='2. Metadata'!N$1,'2. Metadata'!N$6))))))))))))))","v":-117.88417},"n/a",0.024,{"$f":"IF(ISBLANK(F112)=TRUE,\" \",'2. Metadata'!B$14)","v":"degrees Celsius"},-0.004,{"$f":"IF(ISBLANK(H112)=TRUE,\" \",'2. Metadata'!B$26)","v":"degrees Celsius"},0.003,{"$f":"IF(ISBLANK(J112)=TRUE,\" \",'2. Metadata'!B$38)","v":"degrees Celsius"},"n/a"]
["2013-11-23","NECAR01",{"$f":"IF(ISBLANK(B113)=TRUE,\" \", IF(B113='2. Metadata'!B$1,'2. Metadata'!B$5, IF(B113='2. Metadata'!C$1,'2. Metadata'!C$5,IF(B113='2. Metadata'!D$1,'2. Metadata'!D$5, IF(B113='2. Metadata'!E$1,'2. Metadata'!E$5,IF( B113='2. Metadata'!F$1,'2. Metadata'!F$5,IF(B113='2. Metadata'!G$1,'2. Metadata'!G$5,IF(B113='2. Metadata'!H$1,'2. Metadata'!H$5, IF(B113='2. Metadata'!I$1,'2. Metadata'!I$5, IF(B113='2. Metadata'!J$1,'2. Metadata'!J$5, IF(B113='2. Metadata'!K$1,'2. Metadata'!K$5, IF(B113='2. Metadata'!L$1,'2. Metadata'!L$5, IF(B113='2. Metadata'!M$1,'2. Metadata'!M$5, IF(B113='2. Metadata'!N$1,'2. Metadata'!N$5))))))))))))))","v":49.97944},{"$f":"IF(ISBLANK(B113)=TRUE,\" \", IF(B113='2. Metadata'!B$1,'2. Metadata'!B$6, IF(B113='2. Metadata'!C$1,'2. Metadata'!C$6,IF(B113='2. Metadata'!D$1,'2. Metadata'!D$6, IF(B113='2. Metadata'!E$1,'2. Metadata'!E$6,IF( B113='2. Metadata'!F$1,'2. Metadata'!F$6,IF(B113='2. Metadata'!G$1,'2. Metadata'!G$6,IF(B113='2. Metadata'!H$1,'2. Metadata'!H$6, IF(B113='2. Metadata'!I$1,'2. Metadata'!I$6, IF(B113='2. Metadata'!J$1,'2. Metadata'!J$6, IF(B113='2. Metadata'!K$1,'2. Metadata'!K$6, IF(B113='2. Metadata'!L$1,'2. Metadata'!L$6, IF(B113='2. Metadata'!M$1,'2. Metadata'!M$6, IF(B113='2. Metadata'!N$1,'2. Metadata'!N$6))))))))))))))","v":-117.88417},"n/a",0.024,{"$f":"IF(ISBLANK(F113)=TRUE,\" \",'2. Metadata'!B$14)","v":"degrees Celsius"},-0.004,{"$f":"IF(ISBLANK(H113)=TRUE,\" \",'2. Metadata'!B$26)","v":"degrees Celsius"},2E-3,{"$f":"IF(ISBLANK(J113)=TRUE,\" \",'2. Metadata'!B$38)","v":"degrees Celsius"},"n/a"]
["2013-11-24","NECAR01",{"$f":"IF(ISBLANK(B114)=TRUE,\" \", IF(B114='2. Metadata'!B$1,'2. Metadata'!B$5, IF(B114='2. Metadata'!C$1,'2. Metadata'!C$5,IF(B114='2. Metadata'!D$1,'2. Metadata'!D$5, IF(B114='2. Metadata'!E$1,'2. Metadata'!E$5,IF( B114='2. Metadata'!F$1,'2. Metadata'!F$5,IF(B114='2. Metadata'!G$1,'2. Metadata'!G$5,IF(B114='2. Metadata'!H$1,'2. Metadata'!H$5, IF(B114='2. Metadata'!I$1,'2. Metadata'!I$5, IF(B114='2. Metadata'!J$1,'2. Metadata'!J$5, IF(B114='2. Metadata'!K$1,'2. Metadata'!K$5, IF(B114='2. Metadata'!L$1,'2. Metadata'!L$5, IF(B114='2. Metadata'!M$1,'2. Metadata'!M$5, IF(B114='2. Metadata'!N$1,'2. Metadata'!N$5))))))))))))))","v":49.97944},{"$f":"IF(ISBLANK(B114)=TRUE,\" \", IF(B114='2. Metadata'!B$1,'2. Metadata'!B$6, IF(B114='2. Metadata'!C$1,'2. Metadata'!C$6,IF(B114='2. Metadata'!D$1,'2. Metadata'!D$6, IF(B114='2. Metadata'!E$1,'2. Metadata'!E$6,IF( B114='2. Metadata'!F$1,'2. Metadata'!F$6,IF(B114='2. Metadata'!G$1,'2. Metadata'!G$6,IF(B114='2. Metadata'!H$1,'2. Metadata'!H$6, IF(B114='2. Metadata'!I$1,'2. Metadata'!I$6, IF(B114='2. Metadata'!J$1,'2. Metadata'!J$6, IF(B114='2. Metadata'!K$1,'2. Metadata'!K$6, IF(B114='2. Metadata'!L$1,'2. Metadata'!L$6, IF(B114='2. Metadata'!M$1,'2. Metadata'!M$6, IF(B114='2. Metadata'!N$1,'2. Metadata'!N$6))))))))))))))","v":-117.88417},"n/a",0.024,{"$f":"IF(ISBLANK(F114)=TRUE,\" \",'2. Metadata'!B$14)","v":"degrees Celsius"},-0.004,{"$f":"IF(ISBLANK(H114)=TRUE,\" \",'2. Metadata'!B$26)","v":"degrees Celsius"},0,{"$f":"IF(ISBLANK(J114)=TRUE,\" \",'2. Metadata'!B$38)","v":"degrees Celsius"},"n/a"]
["2013-11-25","NECAR01",{"$f":"IF(ISBLANK(B115)=TRUE,\" \", IF(B115='2. Metadata'!B$1,'2. Metadata'!B$5, IF(B115='2. Metadata'!C$1,'2. Metadata'!C$5,IF(B115='2. Metadata'!D$1,'2. Metadata'!D$5, IF(B115='2. Metadata'!E$1,'2. Metadata'!E$5,IF( B115='2. Metadata'!F$1,'2. Metadata'!F$5,IF(B115='2. Metadata'!G$1,'2. Metadata'!G$5,IF(B115='2. Metadata'!H$1,'2. Metadata'!H$5, IF(B115='2. Metadata'!I$1,'2. Metadata'!I$5, IF(B115='2. Metadata'!J$1,'2. Metadata'!J$5, IF(B115='2. Metadata'!K$1,'2. Metadata'!K$5, IF(B115='2. Metadata'!L$1,'2. Metadata'!L$5, IF(B115='2. Metadata'!M$1,'2. Metadata'!M$5, IF(B115='2. Metadata'!N$1,'2. Metadata'!N$5))))))))))))))","v":49.97944},{"$f":"IF(ISBLANK(B115)=TRUE,\" \", IF(B115='2. Metadata'!B$1,'2. Metadata'!B$6, IF(B115='2. Metadata'!C$1,'2. Metadata'!C$6,IF(B115='2. Metadata'!D$1,'2. Metadata'!D$6, IF(B115='2. Metadata'!E$1,'2. Metadata'!E$6,IF( B115='2. Metadata'!F$1,'2. Metadata'!F$6,IF(B115='2. Metadata'!G$1,'2. Metadata'!G$6,IF(B115='2. Metadata'!H$1,'2. Metadata'!H$6, IF(B115='2. Metadata'!I$1,'2. Metadata'!I$6, IF(B115='2. Metadata'!J$1,'2. Metadata'!J$6, IF(B115='2. Metadata'!K$1,'2. Metadata'!K$6, IF(B115='2. Metadata'!L$1,'2. Metadata'!L$6, IF(B115='2. Metadata'!M$1,'2. Metadata'!M$6, IF(B115='2. Metadata'!N$1,'2. Metadata'!N$6))))))))))))))","v":-117.88417},"n/a",0.301,{"$f":"IF(ISBLANK(F115)=TRUE,\" \",'2. Metadata'!B$14)","v":"degrees Celsius"},-0.004,{"$f":"IF(ISBLANK(H115)=TRUE,\" \",'2. Metadata'!B$26)","v":"degrees Celsius"},0.077,{"$f":"IF(ISBLANK(J115)=TRUE,\" \",'2. Metadata'!B$38)","v":"degrees Celsius"},"n/a"]
["2013-11-26","NECAR01",{"$f":"IF(ISBLANK(B116)=TRUE,\" \", IF(B116='2. Metadata'!B$1,'2. Metadata'!B$5, IF(B116='2. Metadata'!C$1,'2. Metadata'!C$5,IF(B116='2. Metadata'!D$1,'2. Metadata'!D$5, IF(B116='2. Metadata'!E$1,'2. Metadata'!E$5,IF( B116='2. Metadata'!F$1,'2. Metadata'!F$5,IF(B116='2. Metadata'!G$1,'2. Metadata'!G$5,IF(B116='2. Metadata'!H$1,'2. Metadata'!H$5, IF(B116='2. Metadata'!I$1,'2. Metadata'!I$5, IF(B116='2. Metadata'!J$1,'2. Metadata'!J$5, IF(B116='2. Metadata'!K$1,'2. Metadata'!K$5, IF(B116='2. Metadata'!L$1,'2. Metadata'!L$5, IF(B116='2. Metadata'!M$1,'2. Metadata'!M$5, IF(B116='2. Metadata'!N$1,'2. Metadata'!N$5))))))))))))))","v":49.97944},{"$f":"IF(ISBLANK(B116)=TRUE,\" \", IF(B116='2. Metadata'!B$1,'2. Metadata'!B$6, IF(B116='2. Metadata'!C$1,'2. Metadata'!C$6,IF(B116='2. Metadata'!D$1,'2. Metadata'!D$6, IF(B116='2. Metadata'!E$1,'2. Metadata'!E$6,IF( B116='2. Metadata'!F$1,'2. Metadata'!F$6,IF(B116='2. Metadata'!G$1,'2. Metadata'!G$6,IF(B116='2. Metadata'!H$1,'2. Metadata'!H$6, IF(B116='2. Metadata'!I$1,'2. Metadata'!I$6, IF(B116='2. Metadata'!J$1,'2. Metadata'!J$6, IF(B116='2. Metadata'!K$1,'2. Metadata'!K$6, IF(B116='2. Metadata'!L$1,'2. Metadata'!L$6, IF(B116='2. Metadata'!M$1,'2. Metadata'!M$6, IF(B116='2. Metadata'!N$1,'2. Metadata'!N$6))))))))))))))","v":-117.88417},"n/a",0.742,{"$f":"IF(ISBLANK(F116)=TRUE,\" \",'2. Metadata'!B$14)","v":"degrees Celsius"},0.135,{"$f":"IF(ISBLANK(H116)=TRUE,\" \",'2. Metadata'!B$26)","v":"degrees Celsius"},0.469,{"$f":"IF(ISBLANK(J116)=TRUE,\" \",'2. Metadata'!B$38)","v":"degrees Celsius"},"n/a"]
["2013-11-27","NECAR01",{"$f":"IF(ISBLANK(B117)=TRUE,\" \", IF(B117='2. Metadata'!B$1,'2. Metadata'!B$5, IF(B117='2. Metadata'!C$1,'2. Metadata'!C$5,IF(B117='2. Metadata'!D$1,'2. Metadata'!D$5, IF(B117='2. Metadata'!E$1,'2. Metadata'!E$5,IF( B117='2. Metadata'!F$1,'2. Metadata'!F$5,IF(B117='2. Metadata'!G$1,'2. Metadata'!G$5,IF(B117='2. Metadata'!H$1,'2. Metadata'!H$5, IF(B117='2. Metadata'!I$1,'2. Metadata'!I$5, IF(B117='2. Metadata'!J$1,'2. Metadata'!J$5, IF(B117='2. Metadata'!K$1,'2. Metadata'!K$5, IF(B117='2. Metadata'!L$1,'2. Metadata'!L$5, IF(B117='2. Metadata'!M$1,'2. Metadata'!M$5, IF(B117='2. Metadata'!N$1,'2. Metadata'!N$5))))))))))))))","v":49.97944},{"$f":"IF(ISBLANK(B117)=TRUE,\" \", IF(B117='2. Metadata'!B$1,'2. Metadata'!B$6, IF(B117='2. Metadata'!C$1,'2. Metadata'!C$6,IF(B117='2. Metadata'!D$1,'2. Metadata'!D$6, IF(B117='2. Metadata'!E$1,'2. Metadata'!E$6,IF( B117='2. Metadata'!F$1,'2. Metadata'!F$6,IF(B117='2. Metadata'!G$1,'2. Metadata'!G$6,IF(B117='2. Metadata'!H$1,'2. Metadata'!H$6, IF(B117='2. Metadata'!I$1,'2. Metadata'!I$6, IF(B117='2. Metadata'!J$1,'2. Metadata'!J$6, IF(B117='2. Metadata'!K$1,'2. Metadata'!K$6, IF(B117='2. Metadata'!L$1,'2. Metadata'!L$6, IF(B117='2. Metadata'!M$1,'2. Metadata'!M$6, IF(B117='2. Metadata'!N$1,'2. Metadata'!N$6))))))))))))))","v":-117.88417},"n/a",0.934,{"$f":"IF(ISBLANK(F117)=TRUE,\" \",'2. Metadata'!B$14)","v":"degrees Celsius"},0.577,{"$f":"IF(ISBLANK(H117)=TRUE,\" \",'2. Metadata'!B$26)","v":"degrees Celsius"},0.72,{"$f":"IF(ISBLANK(J117)=TRUE,\" \",'2. Metadata'!B$38)","v":"degrees Celsius"},"n/a"]
["2013-11-28","NECAR01",{"$f":"IF(ISBLANK(B118)=TRUE,\" \", IF(B118='2. Metadata'!B$1,'2. Metadata'!B$5, IF(B118='2. Metadata'!C$1,'2. Metadata'!C$5,IF(B118='2. Metadata'!D$1,'2. Metadata'!D$5, IF(B118='2. Metadata'!E$1,'2. Metadata'!E$5,IF( B118='2. Metadata'!F$1,'2. Metadata'!F$5,IF(B118='2. Metadata'!G$1,'2. Metadata'!G$5,IF(B118='2. Metadata'!H$1,'2. Metadata'!H$5, IF(B118='2. Metadata'!I$1,'2. Metadata'!I$5, IF(B118='2. Metadata'!J$1,'2. Metadata'!J$5, IF(B118='2. Metadata'!K$1,'2. Metadata'!K$5, IF(B118='2. Metadata'!L$1,'2. Metadata'!L$5, IF(B118='2. Metadata'!M$1,'2. Metadata'!M$5, IF(B118='2. Metadata'!N$1,'2. Metadata'!N$5))))))))))))))","v":49.97944},{"$f":"IF(ISBLANK(B118)=TRUE,\" \", IF(B118='2. Metadata'!B$1,'2. Metadata'!B$6, IF(B118='2. Metadata'!C$1,'2. Metadata'!C$6,IF(B118='2. Metadata'!D$1,'2. Metadata'!D$6, IF(B118='2. Metadata'!E$1,'2. Metadata'!E$6,IF( B118='2. Metadata'!F$1,'2. Metadata'!F$6,IF(B118='2. Metadata'!G$1,'2. Metadata'!G$6,IF(B118='2. Metadata'!H$1,'2. Metadata'!H$6, IF(B118='2. Metadata'!I$1,'2. Metadata'!I$6, IF(B118='2. Metadata'!J$1,'2. Metadata'!J$6, IF(B118='2. Metadata'!K$1,'2. Metadata'!K$6, IF(B118='2. Metadata'!L$1,'2. Metadata'!L$6, IF(B118='2. Metadata'!M$1,'2. Metadata'!M$6, IF(B118='2. Metadata'!N$1,'2. Metadata'!N$6))))))))))))))","v":-117.88417},"n/a",1.262,{"$f":"IF(ISBLANK(F118)=TRUE,\" \",'2. Metadata'!B$14)","v":"degrees Celsius"},0.687,{"$f":"IF(ISBLANK(H118)=TRUE,\" \",'2. Metadata'!B$26)","v":"degrees Celsius"},0.9,{"$f":"IF(ISBLANK(J118)=TRUE,\" \",'2. Metadata'!B$38)","v":"degrees Celsius"},"n/a"]
["2013-11-29","NECAR01",{"$f":"IF(ISBLANK(B119)=TRUE,\" \", IF(B119='2. Metadata'!B$1,'2. Metadata'!B$5, IF(B119='2. Metadata'!C$1,'2. Metadata'!C$5,IF(B119='2. Metadata'!D$1,'2. Metadata'!D$5, IF(B119='2. Metadata'!E$1,'2. Metadata'!E$5,IF( B119='2. Metadata'!F$1,'2. Metadata'!F$5,IF(B119='2. Metadata'!G$1,'2. Metadata'!G$5,IF(B119='2. Metadata'!H$1,'2. Metadata'!H$5, IF(B119='2. Metadata'!I$1,'2. Metadata'!I$5, IF(B119='2. Metadata'!J$1,'2. Metadata'!J$5, IF(B119='2. Metadata'!K$1,'2. Metadata'!K$5, IF(B119='2. Metadata'!L$1,'2. Metadata'!L$5, IF(B119='2. Metadata'!M$1,'2. Metadata'!M$5, IF(B119='2. Metadata'!N$1,'2. Metadata'!N$5))))))))))))))","v":49.97944},{"$f":"IF(ISBLANK(B119)=TRUE,\" \", IF(B119='2. Metadata'!B$1,'2. Metadata'!B$6, IF(B119='2. Metadata'!C$1,'2. Metadata'!C$6,IF(B119='2. Metadata'!D$1,'2. Metadata'!D$6, IF(B119='2. Metadata'!E$1,'2. Metadata'!E$6,IF( B119='2. Metadata'!F$1,'2. Metadata'!F$6,IF(B119='2. Metadata'!G$1,'2. Metadata'!G$6,IF(B119='2. Metadata'!H$1,'2. Metadata'!H$6, IF(B119='2. Metadata'!I$1,'2. Metadata'!I$6, IF(B119='2. Metadata'!J$1,'2. Metadata'!J$6, IF(B119='2. Metadata'!K$1,'2. Metadata'!K$6, IF(B119='2. Metadata'!L$1,'2. Metadata'!L$6, IF(B119='2. Metadata'!M$1,'2. Metadata'!M$6, IF(B119='2. Metadata'!N$1,'2. Metadata'!N$6))))))))))))))","v":-117.88417},"n/a",1.344,{"$f":"IF(ISBLANK(F119)=TRUE,\" \",'2. Metadata'!B$14)","v":"degrees Celsius"},0.989,{"$f":"IF(ISBLANK(H119)=TRUE,\" \",'2. Metadata'!B$26)","v":"degrees Celsius"},1.144,{"$f":"IF(ISBLANK(J119)=TRUE,\" \",'2. Metadata'!B$38)","v":"degrees Celsius"},"n/a"]
["2013-11-30","NECAR01",{"$f":"IF(ISBLANK(B120)=TRUE,\" \", IF(B120='2. Metadata'!B$1,'2. Metadata'!B$5, IF(B120='2. Metadata'!C$1,'2. Metadata'!C$5,IF(B120='2. Metadata'!D$1,'2. Metadata'!D$5, IF(B120='2. Metadata'!E$1,'2. Metadata'!E$5,IF( B120='2. Metadata'!F$1,'2. Metadata'!F$5,IF(B120='2. Metadata'!G$1,'2. Metadata'!G$5,IF(B120='2. Metadata'!H$1,'2. Metadata'!H$5, IF(B120='2. Metadata'!I$1,'2. Metadata'!I$5, IF(B120='2. Metadata'!J$1,'2. Metadata'!J$5, IF(B120='2. Metadata'!K$1,'2. Metadata'!K$5, IF(B120='2. Metadata'!L$1,'2. Metadata'!L$5, IF(B120='2. Metadata'!M$1,'2. Metadata'!M$5, IF(B120='2. Metadata'!N$1,'2. Metadata'!N$5))))))))))))))","v":49.97944},{"$f":"IF(ISBLANK(B120)=TRUE,\" \", IF(B120='2. Metadata'!B$1,'2. Metadata'!B$6, IF(B120='2. Metadata'!C$1,'2. Metadata'!C$6,IF(B120='2. Metadata'!D$1,'2. Metadata'!D$6, IF(B120='2. Metadata'!E$1,'2. Metadata'!E$6,IF( B120='2. Metadata'!F$1,'2. Metadata'!F$6,IF(B120='2. Metadata'!G$1,'2. Metadata'!G$6,IF(B120='2. Metadata'!H$1,'2. Metadata'!H$6, IF(B120='2. Metadata'!I$1,'2. Metadata'!I$6, IF(B120='2. Metadata'!J$1,'2. Metadata'!J$6, IF(B120='2. Metadata'!K$1,'2. Metadata'!K$6, IF(B120='2. Metadata'!L$1,'2. Metadata'!L$6, IF(B120='2. Metadata'!M$1,'2. Metadata'!M$6, IF(B120='2. Metadata'!N$1,'2. Metadata'!N$6))))))))))))))","v":-117.88417},"n/a",1.859,{"$f":"IF(ISBLANK(F120)=TRUE,\" \",'2. Metadata'!B$14)","v":"degrees Celsius"},1.344,{"$f":"IF(ISBLANK(H120)=TRUE,\" \",'2. Metadata'!B$26)","v":"degrees Celsius"},1.563,{"$f":"IF(ISBLANK(J120)=TRUE,\" \",'2. Metadata'!B$38)","v":"degrees Celsius"},"n/a"]
["2013-12-01","NECAR01",{"$f":"IF(ISBLANK(B121)=TRUE,\" \", IF(B121='2. Metadata'!B$1,'2. Metadata'!B$5, IF(B121='2. Metadata'!C$1,'2. Metadata'!C$5,IF(B121='2. Metadata'!D$1,'2. Metadata'!D$5, IF(B121='2. Metadata'!E$1,'2. Metadata'!E$5,IF( B121='2. Metadata'!F$1,'2. Metadata'!F$5,IF(B121='2. Metadata'!G$1,'2. Metadata'!G$5,IF(B121='2. Metadata'!H$1,'2. Metadata'!H$5, IF(B121='2. Metadata'!I$1,'2. Metadata'!I$5, IF(B121='2. Metadata'!J$1,'2. Metadata'!J$5, IF(B121='2. Metadata'!K$1,'2. Metadata'!K$5, IF(B121='2. Metadata'!L$1,'2. Metadata'!L$5, IF(B121='2. Metadata'!M$1,'2. Metadata'!M$5, IF(B121='2. Metadata'!N$1,'2. Metadata'!N$5))))))))))))))","v":49.97944},{"$f":"IF(ISBLANK(B121)=TRUE,\" \", IF(B121='2. Metadata'!B$1,'2. Metadata'!B$6, IF(B121='2. Metadata'!C$1,'2. Metadata'!C$6,IF(B121='2. Metadata'!D$1,'2. Metadata'!D$6, IF(B121='2. Metadata'!E$1,'2. Metadata'!E$6,IF( B121='2. Metadata'!F$1,'2. Metadata'!F$6,IF(B121='2. Metadata'!G$1,'2. Metadata'!G$6,IF(B121='2. Metadata'!H$1,'2. Metadata'!H$6, IF(B121='2. Metadata'!I$1,'2. Metadata'!I$6, IF(B121='2. Metadata'!J$1,'2. Metadata'!J$6, IF(B121='2. Metadata'!K$1,'2. Metadata'!K$6, IF(B121='2. Metadata'!L$1,'2. Metadata'!L$6, IF(B121='2. Metadata'!M$1,'2. Metadata'!M$6, IF(B121='2. Metadata'!N$1,'2. Metadata'!N$6))))))))))))))","v":-117.88417},"n/a",1.643,{"$f":"IF(ISBLANK(F121)=TRUE,\" \",'2. Metadata'!B$14)","v":"degrees Celsius"},0.825,{"$f":"IF(ISBLANK(H121)=TRUE,\" \",'2. Metadata'!B$26)","v":"degrees Celsius"},1.203,{"$f":"IF(ISBLANK(J121)=TRUE,\" \",'2. Metadata'!B$38)","v":"degrees Celsius"},"n/a"]
["2013-12-02","NECAR01",{"$f":"IF(ISBLANK(B122)=TRUE,\" \", IF(B122='2. Metadata'!B$1,'2. Metadata'!B$5, IF(B122='2. Metadata'!C$1,'2. Metadata'!C$5,IF(B122='2. Metadata'!D$1,'2. Metadata'!D$5, IF(B122='2. Metadata'!E$1,'2. Metadata'!E$5,IF( B122='2. Metadata'!F$1,'2. Metadata'!F$5,IF(B122='2. Metadata'!G$1,'2. Metadata'!G$5,IF(B122='2. Metadata'!H$1,'2. Metadata'!H$5, IF(B122='2. Metadata'!I$1,'2. Metadata'!I$5, IF(B122='2. Metadata'!J$1,'2. Metadata'!J$5, IF(B122='2. Metadata'!K$1,'2. Metadata'!K$5, IF(B122='2. Metadata'!L$1,'2. Metadata'!L$5, IF(B122='2. Metadata'!M$1,'2. Metadata'!M$5, IF(B122='2. Metadata'!N$1,'2. Metadata'!N$5))))))))))))))","v":49.97944},{"$f":"IF(ISBLANK(B122)=TRUE,\" \", IF(B122='2. Metadata'!B$1,'2. Metadata'!B$6, IF(B122='2. Metadata'!C$1,'2. Metadata'!C$6,IF(B122='2. Metadata'!D$1,'2. Metadata'!D$6, IF(B122='2. Metadata'!E$1,'2. Metadata'!E$6,IF( B122='2. Metadata'!F$1,'2. Metadata'!F$6,IF(B122='2. Metadata'!G$1,'2. Metadata'!G$6,IF(B122='2. Metadata'!H$1,'2. Metadata'!H$6, IF(B122='2. Metadata'!I$1,'2. Metadata'!I$6, IF(B122='2. Metadata'!J$1,'2. Metadata'!J$6, IF(B122='2. Metadata'!K$1,'2. Metadata'!K$6, IF(B122='2. Metadata'!L$1,'2. Metadata'!L$6, IF(B122='2. Metadata'!M$1,'2. Metadata'!M$6, IF(B122='2. Metadata'!N$1,'2. Metadata'!N$6))))))))))))))","v":-117.88417},"n/a",1.534,{"$f":"IF(ISBLANK(F122)=TRUE,\" \",'2. Metadata'!B$14)","v":"degrees Celsius"},0.797,{"$f":"IF(ISBLANK(H122)=TRUE,\" \",'2. Metadata'!B$26)","v":"degrees Celsius"},1.054,{"$f":"IF(ISBLANK(J122)=TRUE,\" \",'2. Metadata'!B$38)","v":"degrees Celsius"},"n/a"]
["2013-12-03","NECAR01",{"$f":"IF(ISBLANK(B123)=TRUE,\" \", IF(B123='2. Metadata'!B$1,'2. Metadata'!B$5, IF(B123='2. Metadata'!C$1,'2. Metadata'!C$5,IF(B123='2. Metadata'!D$1,'2. Metadata'!D$5, IF(B123='2. Metadata'!E$1,'2. Metadata'!E$5,IF( B123='2. Metadata'!F$1,'2. Metadata'!F$5,IF(B123='2. Metadata'!G$1,'2. Metadata'!G$5,IF(B123='2. Metadata'!H$1,'2. Metadata'!H$5, IF(B123='2. Metadata'!I$1,'2. Metadata'!I$5, IF(B123='2. Metadata'!J$1,'2. Metadata'!J$5, IF(B123='2. Metadata'!K$1,'2. Metadata'!K$5, IF(B123='2. Metadata'!L$1,'2. Metadata'!L$5, IF(B123='2. Metadata'!M$1,'2. Metadata'!M$5, IF(B123='2. Metadata'!N$1,'2. Metadata'!N$5))))))))))))))","v":49.97944},{"$f":"IF(ISBLANK(B123)=TRUE,\" \", IF(B123='2. Metadata'!B$1,'2. Metadata'!B$6, IF(B123='2. Metadata'!C$1,'2. Metadata'!C$6,IF(B123='2. Metadata'!D$1,'2. Metadata'!D$6, IF(B123='2. Metadata'!E$1,'2. Metadata'!E$6,IF( B123='2. Metadata'!F$1,'2. Metadata'!F$6,IF(B123='2. Metadata'!G$1,'2. Metadata'!G$6,IF(B123='2. Metadata'!H$1,'2. Metadata'!H$6, IF(B123='2. Metadata'!I$1,'2. Metadata'!I$6, IF(B123='2. Metadata'!J$1,'2. Metadata'!J$6, IF(B123='2. Metadata'!K$1,'2. Metadata'!K$6, IF(B123='2. Metadata'!L$1,'2. Metadata'!L$6, IF(B123='2. Metadata'!M$1,'2. Metadata'!M$6, IF(B123='2. Metadata'!N$1,'2. Metadata'!N$6))))))))))))))","v":-117.88417},"n/a",0.742,{"$f":"IF(ISBLANK(F123)=TRUE,\" \",'2. Metadata'!B$14)","v":"degrees Celsius"},0.135,{"$f":"IF(ISBLANK(H123)=TRUE,\" \",'2. Metadata'!B$26)","v":"degrees Celsius"},0.4,{"$f":"IF(ISBLANK(J123)=TRUE,\" \",'2. Metadata'!B$38)","v":"degrees Celsius"},"n/a"]
["2013-12-04","NECAR01",{"$f":"IF(ISBLANK(B124)=TRUE,\" \", IF(B124='2. Metadata'!B$1,'2. Metadata'!B$5, IF(B124='2. Metadata'!C$1,'2. Metadata'!C$5,IF(B124='2. Metadata'!D$1,'2. Metadata'!D$5, IF(B124='2. Metadata'!E$1,'2. Metadata'!E$5,IF( B124='2. Metadata'!F$1,'2. Metadata'!F$5,IF(B124='2. Metadata'!G$1,'2. Metadata'!G$5,IF(B124='2. Metadata'!H$1,'2. Metadata'!H$5, IF(B124='2. Metadata'!I$1,'2. Metadata'!I$5, IF(B124='2. Metadata'!J$1,'2. Metadata'!J$5, IF(B124='2. Metadata'!K$1,'2. Metadata'!K$5, IF(B124='2. Metadata'!L$1,'2. Metadata'!L$5, IF(B124='2. Metadata'!M$1,'2. Metadata'!M$5, IF(B124='2. Metadata'!N$1,'2. Metadata'!N$5))))))))))))))","v":49.97944},{"$f":"IF(ISBLANK(B124)=TRUE,\" \", IF(B124='2. Metadata'!B$1,'2. Metadata'!B$6, IF(B124='2. Metadata'!C$1,'2. Metadata'!C$6,IF(B124='2. Metadata'!D$1,'2. Metadata'!D$6, IF(B124='2. Metadata'!E$1,'2. Metadata'!E$6,IF( B124='2. Metadata'!F$1,'2. Metadata'!F$6,IF(B124='2. Metadata'!G$1,'2. Metadata'!G$6,IF(B124='2. Metadata'!H$1,'2. Metadata'!H$6, IF(B124='2. Metadata'!I$1,'2. Metadata'!I$6, IF(B124='2. Metadata'!J$1,'2. Metadata'!J$6, IF(B124='2. Metadata'!K$1,'2. Metadata'!K$6, IF(B124='2. Metadata'!L$1,'2. Metadata'!L$6, IF(B124='2. Metadata'!M$1,'2. Metadata'!M$6, IF(B124='2. Metadata'!N$1,'2. Metadata'!N$6))))))))))))))","v":-117.88417},"n/a",0.273,{"$f":"IF(ISBLANK(F124)=TRUE,\" \",'2. Metadata'!B$14)","v":"degrees Celsius"},-0.032,{"$f":"IF(ISBLANK(H124)=TRUE,\" \",'2. Metadata'!B$26)","v":"degrees Celsius"},0.022,{"$f":"IF(ISBLANK(J124)=TRUE,\" \",'2. Metadata'!B$38)","v":"degrees Celsius"},"n/a"]
["2013-12-05","NECAR01",{"$f":"IF(ISBLANK(B125)=TRUE,\" \", IF(B125='2. Metadata'!B$1,'2. Metadata'!B$5, IF(B125='2. Metadata'!C$1,'2. Metadata'!C$5,IF(B125='2. Metadata'!D$1,'2. Metadata'!D$5, IF(B125='2. Metadata'!E$1,'2. Metadata'!E$5,IF( B125='2. Metadata'!F$1,'2. Metadata'!F$5,IF(B125='2. Metadata'!G$1,'2. Metadata'!G$5,IF(B125='2. Metadata'!H$1,'2. Metadata'!H$5, IF(B125='2. Metadata'!I$1,'2. Metadata'!I$5, IF(B125='2. Metadata'!J$1,'2. Metadata'!J$5, IF(B125='2. Metadata'!K$1,'2. Metadata'!K$5, IF(B125='2. Metadata'!L$1,'2. Metadata'!L$5, IF(B125='2. Metadata'!M$1,'2. Metadata'!M$5, IF(B125='2. Metadata'!N$1,'2. Metadata'!N$5))))))))))))))","v":49.97944},{"$f":"IF(ISBLANK(B125)=TRUE,\" \", IF(B125='2. Metadata'!B$1,'2. Metadata'!B$6, IF(B125='2. Metadata'!C$1,'2. Metadata'!C$6,IF(B125='2. Metadata'!D$1,'2. Metadata'!D$6, IF(B125='2. Metadata'!E$1,'2. Metadata'!E$6,IF( B125='2. Metadata'!F$1,'2. Metadata'!F$6,IF(B125='2. Metadata'!G$1,'2. Metadata'!G$6,IF(B125='2. Metadata'!H$1,'2. Metadata'!H$6, IF(B125='2. Metadata'!I$1,'2. Metadata'!I$6, IF(B125='2. Metadata'!J$1,'2. Metadata'!J$6, IF(B125='2. Metadata'!K$1,'2. Metadata'!K$6, IF(B125='2. Metadata'!L$1,'2. Metadata'!L$6, IF(B125='2. Metadata'!M$1,'2. Metadata'!M$6, IF(B125='2. Metadata'!N$1,'2. Metadata'!N$6))))))))))))))","v":-117.88417},"n/a",-0.004,{"$f":"IF(ISBLANK(F125)=TRUE,\" \",'2. Metadata'!B$14)","v":"degrees Celsius"},-0.032,{"$f":"IF(ISBLANK(H125)=TRUE,\" \",'2. Metadata'!B$26)","v":"degrees Celsius"},-0.024,{"$f":"IF(ISBLANK(J125)=TRUE,\" \",'2. Metadata'!B$38)","v":"degrees Celsius"},"n/a"]
["2013-12-06","NECAR01",{"$f":"IF(ISBLANK(B126)=TRUE,\" \", IF(B126='2. Metadata'!B$1,'2. Metadata'!B$5, IF(B126='2. Metadata'!C$1,'2. Metadata'!C$5,IF(B126='2. Metadata'!D$1,'2. Metadata'!D$5, IF(B126='2. Metadata'!E$1,'2. Metadata'!E$5,IF( B126='2. Metadata'!F$1,'2. Metadata'!F$5,IF(B126='2. Metadata'!G$1,'2. Metadata'!G$5,IF(B126='2. Metadata'!H$1,'2. Metadata'!H$5, IF(B126='2. Metadata'!I$1,'2. Metadata'!I$5, IF(B126='2. Metadata'!J$1,'2. Metadata'!J$5, IF(B126='2. Metadata'!K$1,'2. Metadata'!K$5, IF(B126='2. Metadata'!L$1,'2. Metadata'!L$5, IF(B126='2. Metadata'!M$1,'2. Metadata'!M$5, IF(B126='2. Metadata'!N$1,'2. Metadata'!N$5))))))))))))))","v":49.97944},{"$f":"IF(ISBLANK(B126)=TRUE,\" \", IF(B126='2. Metadata'!B$1,'2. Metadata'!B$6, IF(B126='2. Metadata'!C$1,'2. Metadata'!C$6,IF(B126='2. Metadata'!D$1,'2. Metadata'!D$6, IF(B126='2. Metadata'!E$1,'2. Metadata'!E$6,IF( B126='2. Metadata'!F$1,'2. Metadata'!F$6,IF(B126='2. Metadata'!G$1,'2. Metadata'!G$6,IF(B126='2. Metadata'!H$1,'2. Metadata'!H$6, IF(B126='2. Metadata'!I$1,'2. Metadata'!I$6, IF(B126='2. Metadata'!J$1,'2. Metadata'!J$6, IF(B126='2. Metadata'!K$1,'2. Metadata'!K$6, IF(B126='2. Metadata'!L$1,'2. Metadata'!L$6, IF(B126='2. Metadata'!M$1,'2. Metadata'!M$6, IF(B126='2. Metadata'!N$1,'2. Metadata'!N$6))))))))))))))","v":-117.88417},"n/a",-0.004,{"$f":"IF(ISBLANK(F126)=TRUE,\" \",'2. Metadata'!B$14)","v":"degrees Celsius"},-0.032,{"$f":"IF(ISBLANK(H126)=TRUE,\" \",'2. Metadata'!B$26)","v":"degrees Celsius"},-0.026,{"$f":"IF(ISBLANK(J126)=TRUE,\" \",'2. Metadata'!B$38)","v":"degrees Celsius"},"n/a"]
["2013-12-07","NECAR01",{"$f":"IF(ISBLANK(B127)=TRUE,\" \", IF(B127='2. Metadata'!B$1,'2. Metadata'!B$5, IF(B127='2. Metadata'!C$1,'2. Metadata'!C$5,IF(B127='2. Metadata'!D$1,'2. Metadata'!D$5, IF(B127='2. Metadata'!E$1,'2. Metadata'!E$5,IF( B127='2. Metadata'!F$1,'2. Metadata'!F$5,IF(B127='2. Metadata'!G$1,'2. Metadata'!G$5,IF(B127='2. Metadata'!H$1,'2. Metadata'!H$5, IF(B127='2. Metadata'!I$1,'2. Metadata'!I$5, IF(B127='2. Metadata'!J$1,'2. Metadata'!J$5, IF(B127='2. Metadata'!K$1,'2. Metadata'!K$5, IF(B127='2. Metadata'!L$1,'2. Metadata'!L$5, IF(B127='2. Metadata'!M$1,'2. Metadata'!M$5, IF(B127='2. Metadata'!N$1,'2. Metadata'!N$5))))))))))))))","v":49.97944},{"$f":"IF(ISBLANK(B127)=TRUE,\" \", IF(B127='2. Metadata'!B$1,'2. Metadata'!B$6, IF(B127='2. Metadata'!C$1,'2. Metadata'!C$6,IF(B127='2. Metadata'!D$1,'2. Metadata'!D$6, IF(B127='2. Metadata'!E$1,'2. Metadata'!E$6,IF( B127='2. Metadata'!F$1,'2. Metadata'!F$6,IF(B127='2. Metadata'!G$1,'2. Metadata'!G$6,IF(B127='2. Metadata'!H$1,'2. Metadata'!H$6, IF(B127='2. Metadata'!I$1,'2. Metadata'!I$6, IF(B127='2. Metadata'!J$1,'2. Metadata'!J$6, IF(B127='2. Metadata'!K$1,'2. Metadata'!K$6, IF(B127='2. Metadata'!L$1,'2. Metadata'!L$6, IF(B127='2. Metadata'!M$1,'2. Metadata'!M$6, IF(B127='2. Metadata'!N$1,'2. Metadata'!N$6))))))))))))))","v":-117.88417},"n/a",-0.004,{"$f":"IF(ISBLANK(F127)=TRUE,\" \",'2. Metadata'!B$14)","v":"degrees Celsius"},-0.032,{"$f":"IF(ISBLANK(H127)=TRUE,\" \",'2. Metadata'!B$26)","v":"degrees Celsius"},-0.025,{"$f":"IF(ISBLANK(J127)=TRUE,\" \",'2. Metadata'!B$38)","v":"degrees Celsius"},"n/a"]
["2013-12-08","NECAR01",{"$f":"IF(ISBLANK(B128)=TRUE,\" \", IF(B128='2. Metadata'!B$1,'2. Metadata'!B$5, IF(B128='2. Metadata'!C$1,'2. Metadata'!C$5,IF(B128='2. Metadata'!D$1,'2. Metadata'!D$5, IF(B128='2. Metadata'!E$1,'2. Metadata'!E$5,IF( B128='2. Metadata'!F$1,'2. Metadata'!F$5,IF(B128='2. Metadata'!G$1,'2. Metadata'!G$5,IF(B128='2. Metadata'!H$1,'2. Metadata'!H$5, IF(B128='2. Metadata'!I$1,'2. Metadata'!I$5, IF(B128='2. Metadata'!J$1,'2. Metadata'!J$5, IF(B128='2. Metadata'!K$1,'2. Metadata'!K$5, IF(B128='2. Metadata'!L$1,'2. Metadata'!L$5, IF(B128='2. Metadata'!M$1,'2. Metadata'!M$5, IF(B128='2. Metadata'!N$1,'2. Metadata'!N$5))))))))))))))","v":49.97944},{"$f":"IF(ISBLANK(B128)=TRUE,\" \", IF(B128='2. Metadata'!B$1,'2. Metadata'!B$6, IF(B128='2. Metadata'!C$1,'2. Metadata'!C$6,IF(B128='2. Metadata'!D$1,'2. Metadata'!D$6, IF(B128='2. Metadata'!E$1,'2. Metadata'!E$6,IF( B128='2. Metadata'!F$1,'2. Metadata'!F$6,IF(B128='2. Metadata'!G$1,'2. Metadata'!G$6,IF(B128='2. Metadata'!H$1,'2. Metadata'!H$6, IF(B128='2. Metadata'!I$1,'2. Metadata'!I$6, IF(B128='2. Metadata'!J$1,'2. Metadata'!J$6, IF(B128='2. Metadata'!K$1,'2. Metadata'!K$6, IF(B128='2. Metadata'!L$1,'2. Metadata'!L$6, IF(B128='2. Metadata'!M$1,'2. Metadata'!M$6, IF(B128='2. Metadata'!N$1,'2. Metadata'!N$6))))))))))))))","v":-117.88417},"n/a",-0.004,{"$f":"IF(ISBLANK(F128)=TRUE,\" \",'2. Metadata'!B$14)","v":"degrees Celsius"},-0.032,{"$f":"IF(ISBLANK(H128)=TRUE,\" \",'2. Metadata'!B$26)","v":"degrees Celsius"},-0.014,{"$f":"IF(ISBLANK(J128)=TRUE,\" \",'2. Metadata'!B$38)","v":"degrees Celsius"},"n/a"]
["2013-12-09","NECAR01",{"$f":"IF(ISBLANK(B129)=TRUE,\" \", IF(B129='2. Metadata'!B$1,'2. Metadata'!B$5, IF(B129='2. Metadata'!C$1,'2. Metadata'!C$5,IF(B129='2. Metadata'!D$1,'2. Metadata'!D$5, IF(B129='2. Metadata'!E$1,'2. Metadata'!E$5,IF( B129='2. Metadata'!F$1,'2. Metadata'!F$5,IF(B129='2. Metadata'!G$1,'2. Metadata'!G$5,IF(B129='2. Metadata'!H$1,'2. Metadata'!H$5, IF(B129='2. Metadata'!I$1,'2. Metadata'!I$5, IF(B129='2. Metadata'!J$1,'2. Metadata'!J$5, IF(B129='2. Metadata'!K$1,'2. Metadata'!K$5, IF(B129='2. Metadata'!L$1,'2. Metadata'!L$5, IF(B129='2. Metadata'!M$1,'2. Metadata'!M$5, IF(B129='2. Metadata'!N$1,'2. Metadata'!N$5))))))))))))))","v":49.97944},{"$f":"IF(ISBLANK(B129)=TRUE,\" \", IF(B129='2. Metadata'!B$1,'2. Metadata'!B$6, IF(B129='2. Metadata'!C$1,'2. Metadata'!C$6,IF(B129='2. Metadata'!D$1,'2. Metadata'!D$6, IF(B129='2. Metadata'!E$1,'2. Metadata'!E$6,IF( B129='2. Metadata'!F$1,'2. Metadata'!F$6,IF(B129='2. Metadata'!G$1,'2. Metadata'!G$6,IF(B129='2. Metadata'!H$1,'2. Metadata'!H$6, IF(B129='2. Metadata'!I$1,'2. Metadata'!I$6, IF(B129='2. Metadata'!J$1,'2. Metadata'!J$6, IF(B129='2. Metadata'!K$1,'2. Metadata'!K$6, IF(B129='2. Metadata'!L$1,'2. Metadata'!L$6, IF(B129='2. Metadata'!M$1,'2. Metadata'!M$6, IF(B129='2. Metadata'!N$1,'2. Metadata'!N$6))))))))))))))","v":-117.88417},"n/a",-0.004,{"$f":"IF(ISBLANK(F129)=TRUE,\" \",'2. Metadata'!B$14)","v":"degrees Celsius"},-0.004,{"$f":"IF(ISBLANK(H129)=TRUE,\" \",'2. Metadata'!B$26)","v":"degrees Celsius"},-0.004,{"$f":"IF(ISBLANK(J129)=TRUE,\" \",'2. Metadata'!B$38)","v":"degrees Celsius"},"n/a"]
["2013-12-10","NECAR01",{"$f":"IF(ISBLANK(B130)=TRUE,\" \", IF(B130='2. Metadata'!B$1,'2. Metadata'!B$5, IF(B130='2. Metadata'!C$1,'2. Metadata'!C$5,IF(B130='2. Metadata'!D$1,'2. Metadata'!D$5, IF(B130='2. Metadata'!E$1,'2. Metadata'!E$5,IF( B130='2. Metadata'!F$1,'2. Metadata'!F$5,IF(B130='2. Metadata'!G$1,'2. Metadata'!G$5,IF(B130='2. Metadata'!H$1,'2. Metadata'!H$5, IF(B130='2. Metadata'!I$1,'2. Metadata'!I$5, IF(B130='2. Metadata'!J$1,'2. Metadata'!J$5, IF(B130='2. Metadata'!K$1,'2. Metadata'!K$5, IF(B130='2. Metadata'!L$1,'2. Metadata'!L$5, IF(B130='2. Metadata'!M$1,'2. Metadata'!M$5, IF(B130='2. Metadata'!N$1,'2. Metadata'!N$5))))))))))))))","v":49.97944},{"$f":"IF(ISBLANK(B130)=TRUE,\" \", IF(B130='2. Metadata'!B$1,'2. Metadata'!B$6, IF(B130='2. Metadata'!C$1,'2. Metadata'!C$6,IF(B130='2. Metadata'!D$1,'2. Metadata'!D$6, IF(B130='2. Metadata'!E$1,'2. Metadata'!E$6,IF( B130='2. Metadata'!F$1,'2. Metadata'!F$6,IF(B130='2. Metadata'!G$1,'2. Metadata'!G$6,IF(B130='2. Metadata'!H$1,'2. Metadata'!H$6, IF(B130='2. Metadata'!I$1,'2. Metadata'!I$6, IF(B130='2. Metadata'!J$1,'2. Metadata'!J$6, IF(B130='2. Metadata'!K$1,'2. Metadata'!K$6, IF(B130='2. Metadata'!L$1,'2. Metadata'!L$6, IF(B130='2. Metadata'!M$1,'2. Metadata'!M$6, IF(B130='2. Metadata'!N$1,'2. Metadata'!N$6))))))))))))))","v":-117.88417},"n/a",-0.004,{"$f":"IF(ISBLANK(F130)=TRUE,\" \",'2. Metadata'!B$14)","v":"degrees Celsius"},-0.004,{"$f":"IF(ISBLANK(H130)=TRUE,\" \",'2. Metadata'!B$26)","v":"degrees Celsius"},-0.004,{"$f":"IF(ISBLANK(J130)=TRUE,\" \",'2. Metadata'!B$38)","v":"degrees Celsius"},"n/a"]
["2013-12-11","NECAR01",{"$f":"IF(ISBLANK(B131)=TRUE,\" \", IF(B131='2. Metadata'!B$1,'2. Metadata'!B$5, IF(B131='2. Metadata'!C$1,'2. Metadata'!C$5,IF(B131='2. Metadata'!D$1,'2. Metadata'!D$5, IF(B131='2. Metadata'!E$1,'2. Metadata'!E$5,IF( B131='2. Metadata'!F$1,'2. Metadata'!F$5,IF(B131='2. Metadata'!G$1,'2. Metadata'!G$5,IF(B131='2. Metadata'!H$1,'2. Metadata'!H$5, IF(B131='2. Metadata'!I$1,'2. Metadata'!I$5, IF(B131='2. Metadata'!J$1,'2. Metadata'!J$5, IF(B131='2. Metadata'!K$1,'2. Metadata'!K$5, IF(B131='2. Metadata'!L$1,'2. Metadata'!L$5, IF(B131='2. Metadata'!M$1,'2. Metadata'!M$5, IF(B131='2. Metadata'!N$1,'2. Metadata'!N$5))))))))))))))","v":49.97944},{"$f":"IF(ISBLANK(B131)=TRUE,\" \", IF(B131='2. Metadata'!B$1,'2. Metadata'!B$6, IF(B131='2. Metadata'!C$1,'2. Metadata'!C$6,IF(B131='2. Metadata'!D$1,'2. Metadata'!D$6, IF(B131='2. Metadata'!E$1,'2. Metadata'!E$6,IF( B131='2. Metadata'!F$1,'2. Metadata'!F$6,IF(B131='2. Metadata'!G$1,'2. Metadata'!G$6,IF(B131='2. Metadata'!H$1,'2. Metadata'!H$6, IF(B131='2. Metadata'!I$1,'2. Metadata'!I$6, IF(B131='2. Metadata'!J$1,'2. Metadata'!J$6, IF(B131='2. Metadata'!K$1,'2. Metadata'!K$6, IF(B131='2. Metadata'!L$1,'2. Metadata'!L$6, IF(B131='2. Metadata'!M$1,'2. Metadata'!M$6, IF(B131='2. Metadata'!N$1,'2. Metadata'!N$6))))))))))))))","v":-117.88417},"n/a",-0.004,{"$f":"IF(ISBLANK(F131)=TRUE,\" \",'2. Metadata'!B$14)","v":"degrees Celsius"},-0.004,{"$f":"IF(ISBLANK(H131)=TRUE,\" \",'2. Metadata'!B$26)","v":"degrees Celsius"},-0.004,{"$f":"IF(ISBLANK(J131)=TRUE,\" \",'2. Metadata'!B$38)","v":"degrees Celsius"},"n/a"]
["2013-12-12","NECAR01",{"$f":"IF(ISBLANK(B132)=TRUE,\" \", IF(B132='2. Metadata'!B$1,'2. Metadata'!B$5, IF(B132='2. Metadata'!C$1,'2. Metadata'!C$5,IF(B132='2. Metadata'!D$1,'2. Metadata'!D$5, IF(B132='2. Metadata'!E$1,'2. Metadata'!E$5,IF( B132='2. Metadata'!F$1,'2. Metadata'!F$5,IF(B132='2. Metadata'!G$1,'2. Metadata'!G$5,IF(B132='2. Metadata'!H$1,'2. Metadata'!H$5, IF(B132='2. Metadata'!I$1,'2. Metadata'!I$5, IF(B132='2. Metadata'!J$1,'2. Metadata'!J$5, IF(B132='2. Metadata'!K$1,'2. Metadata'!K$5, IF(B132='2. Metadata'!L$1,'2. Metadata'!L$5, IF(B132='2. Metadata'!M$1,'2. Metadata'!M$5, IF(B132='2. Metadata'!N$1,'2. Metadata'!N$5))))))))))))))","v":49.97944},{"$f":"IF(ISBLANK(B132)=TRUE,\" \", IF(B132='2. Metadata'!B$1,'2. Metadata'!B$6, IF(B132='2. Metadata'!C$1,'2. Metadata'!C$6,IF(B132='2. Metadata'!D$1,'2. Metadata'!D$6, IF(B132='2. Metadata'!E$1,'2. Metadata'!E$6,IF( B132='2. Metadata'!F$1,'2. Metadata'!F$6,IF(B132='2. Metadata'!G$1,'2. Metadata'!G$6,IF(B132='2. Metadata'!H$1,'2. Metadata'!H$6, IF(B132='2. Metadata'!I$1,'2. Metadata'!I$6, IF(B132='2. Metadata'!J$1,'2. Metadata'!J$6, IF(B132='2. Metadata'!K$1,'2. Metadata'!K$6, IF(B132='2. Metadata'!L$1,'2. Metadata'!L$6, IF(B132='2. Metadata'!M$1,'2. Metadata'!M$6, IF(B132='2. Metadata'!N$1,'2. Metadata'!N$6))))))))))))))","v":-117.88417},"n/a",-0.004,{"$f":"IF(ISBLANK(F132)=TRUE,\" \",'2. Metadata'!B$14)","v":"degrees Celsius"},-0.004,{"$f":"IF(ISBLANK(H132)=TRUE,\" \",'2. Metadata'!B$26)","v":"degrees Celsius"},-0.004,{"$f":"IF(ISBLANK(J132)=TRUE,\" \",'2. Metadata'!B$38)","v":"degrees Celsius"},"n/a"]
["2013-12-13","NECAR01",{"$f":"IF(ISBLANK(B133)=TRUE,\" \", IF(B133='2. Metadata'!B$1,'2. Metadata'!B$5, IF(B133='2. Metadata'!C$1,'2. Metadata'!C$5,IF(B133='2. Metadata'!D$1,'2. Metadata'!D$5, IF(B133='2. Metadata'!E$1,'2. Metadata'!E$5,IF( B133='2. Metadata'!F$1,'2. Metadata'!F$5,IF(B133='2. Metadata'!G$1,'2. Metadata'!G$5,IF(B133='2. Metadata'!H$1,'2. Metadata'!H$5, IF(B133='2. Metadata'!I$1,'2. Metadata'!I$5, IF(B133='2. Metadata'!J$1,'2. Metadata'!J$5, IF(B133='2. Metadata'!K$1,'2. Metadata'!K$5, IF(B133='2. Metadata'!L$1,'2. Metadata'!L$5, IF(B133='2. Metadata'!M$1,'2. Metadata'!M$5, IF(B133='2. Metadata'!N$1,'2. Metadata'!N$5))))))))))))))","v":49.97944},{"$f":"IF(ISBLANK(B133)=TRUE,\" \", IF(B133='2. Metadata'!B$1,'2. Metadata'!B$6, IF(B133='2. Metadata'!C$1,'2. Metadata'!C$6,IF(B133='2. Metadata'!D$1,'2. Metadata'!D$6, IF(B133='2. Metadata'!E$1,'2. Metadata'!E$6,IF( B133='2. Metadata'!F$1,'2. Metadata'!F$6,IF(B133='2. Metadata'!G$1,'2. Metadata'!G$6,IF(B133='2. Metadata'!H$1,'2. Metadata'!H$6, IF(B133='2. Metadata'!I$1,'2. Metadata'!I$6, IF(B133='2. Metadata'!J$1,'2. Metadata'!J$6, IF(B133='2. Metadata'!K$1,'2. Metadata'!K$6, IF(B133='2. Metadata'!L$1,'2. Metadata'!L$6, IF(B133='2. Metadata'!M$1,'2. Metadata'!M$6, IF(B133='2. Metadata'!N$1,'2. Metadata'!N$6))))))))))))))","v":-117.88417},"n/a",-0.004,{"$f":"IF(ISBLANK(F133)=TRUE,\" \",'2. Metadata'!B$14)","v":"degrees Celsius"},-0.004,{"$f":"IF(ISBLANK(H133)=TRUE,\" \",'2. Metadata'!B$26)","v":"degrees Celsius"},-0.004,{"$f":"IF(ISBLANK(J133)=TRUE,\" \",'2. Metadata'!B$38)","v":"degrees Celsius"},"n/a"]
["2013-12-14","NECAR01",{"$f":"IF(ISBLANK(B134)=TRUE,\" \", IF(B134='2. Metadata'!B$1,'2. Metadata'!B$5, IF(B134='2. Metadata'!C$1,'2. Metadata'!C$5,IF(B134='2. Metadata'!D$1,'2. Metadata'!D$5, IF(B134='2. Metadata'!E$1,'2. Metadata'!E$5,IF( B134='2. Metadata'!F$1,'2. Metadata'!F$5,IF(B134='2. Metadata'!G$1,'2. Metadata'!G$5,IF(B134='2. Metadata'!H$1,'2. Metadata'!H$5, IF(B134='2. Metadata'!I$1,'2. Metadata'!I$5, IF(B134='2. Metadata'!J$1,'2. Metadata'!J$5, IF(B134='2. Metadata'!K$1,'2. Metadata'!K$5, IF(B134='2. Metadata'!L$1,'2. Metadata'!L$5, IF(B134='2. Metadata'!M$1,'2. Metadata'!M$5, IF(B134='2. Metadata'!N$1,'2. Metadata'!N$5))))))))))))))","v":49.97944},{"$f":"IF(ISBLANK(B134)=TRUE,\" \", IF(B134='2. Metadata'!B$1,'2. Metadata'!B$6, IF(B134='2. Metadata'!C$1,'2. Metadata'!C$6,IF(B134='2. Metadata'!D$1,'2. Metadata'!D$6, IF(B134='2. Metadata'!E$1,'2. Metadata'!E$6,IF( B134='2. Metadata'!F$1,'2. Metadata'!F$6,IF(B134='2. Metadata'!G$1,'2. Metadata'!G$6,IF(B134='2. Metadata'!H$1,'2. Metadata'!H$6, IF(B134='2. Metadata'!I$1,'2. Metadata'!I$6, IF(B134='2. Metadata'!J$1,'2. Metadata'!J$6, IF(B134='2. Metadata'!K$1,'2. Metadata'!K$6, IF(B134='2. Metadata'!L$1,'2. Metadata'!L$6, IF(B134='2. Metadata'!M$1,'2. Metadata'!M$6, IF(B134='2. Metadata'!N$1,'2. Metadata'!N$6))))))))))))))","v":-117.88417},"n/a",-0.004,{"$f":"IF(ISBLANK(F134)=TRUE,\" \",'2. Metadata'!B$14)","v":"degrees Celsius"},-0.004,{"$f":"IF(ISBLANK(H134)=TRUE,\" \",'2. Metadata'!B$26)","v":"degrees Celsius"},-0.004,{"$f":"IF(ISBLANK(J134)=TRUE,\" \",'2. Metadata'!B$38)","v":"degrees Celsius"},"n/a"]
["2013-12-15","NECAR01",{"$f":"IF(ISBLANK(B135)=TRUE,\" \", IF(B135='2. Metadata'!B$1,'2. Metadata'!B$5, IF(B135='2. Metadata'!C$1,'2. Metadata'!C$5,IF(B135='2. Metadata'!D$1,'2. Metadata'!D$5, IF(B135='2. Metadata'!E$1,'2. Metadata'!E$5,IF( B135='2. Metadata'!F$1,'2. Metadata'!F$5,IF(B135='2. Metadata'!G$1,'2. Metadata'!G$5,IF(B135='2. Metadata'!H$1,'2. Metadata'!H$5, IF(B135='2. Metadata'!I$1,'2. Metadata'!I$5, IF(B135='2. Metadata'!J$1,'2. Metadata'!J$5, IF(B135='2. Metadata'!K$1,'2. Metadata'!K$5, IF(B135='2. Metadata'!L$1,'2. Metadata'!L$5, IF(B135='2. Metadata'!M$1,'2. Metadata'!M$5, IF(B135='2. Metadata'!N$1,'2. Metadata'!N$5))))))))))))))","v":49.97944},{"$f":"IF(ISBLANK(B135)=TRUE,\" \", IF(B135='2. Metadata'!B$1,'2. Metadata'!B$6, IF(B135='2. Metadata'!C$1,'2. Metadata'!C$6,IF(B135='2. Metadata'!D$1,'2. Metadata'!D$6, IF(B135='2. Metadata'!E$1,'2. Metadata'!E$6,IF( B135='2. Metadata'!F$1,'2. Metadata'!F$6,IF(B135='2. Metadata'!G$1,'2. Metadata'!G$6,IF(B135='2. Metadata'!H$1,'2. Metadata'!H$6, IF(B135='2. Metadata'!I$1,'2. Metadata'!I$6, IF(B135='2. Metadata'!J$1,'2. Metadata'!J$6, IF(B135='2. Metadata'!K$1,'2. Metadata'!K$6, IF(B135='2. Metadata'!L$1,'2. Metadata'!L$6, IF(B135='2. Metadata'!M$1,'2. Metadata'!M$6, IF(B135='2. Metadata'!N$1,'2. Metadata'!N$6))))))))))))))","v":-117.88417},"n/a",-0.004,{"$f":"IF(ISBLANK(F135)=TRUE,\" \",'2. Metadata'!B$14)","v":"degrees Celsius"},-0.004,{"$f":"IF(ISBLANK(H135)=TRUE,\" \",'2. Metadata'!B$26)","v":"degrees Celsius"},-0.004,{"$f":"IF(ISBLANK(J135)=TRUE,\" \",'2. Metadata'!B$38)","v":"degrees Celsius"},"n/a"]
["2013-12-16","NECAR01",{"$f":"IF(ISBLANK(B136)=TRUE,\" \", IF(B136='2. Metadata'!B$1,'2. Metadata'!B$5, IF(B136='2. Metadata'!C$1,'2. Metadata'!C$5,IF(B136='2. Metadata'!D$1,'2. Metadata'!D$5, IF(B136='2. Metadata'!E$1,'2. Metadata'!E$5,IF( B136='2. Metadata'!F$1,'2. Metadata'!F$5,IF(B136='2. Metadata'!G$1,'2. Metadata'!G$5,IF(B136='2. Metadata'!H$1,'2. Metadata'!H$5, IF(B136='2. Metadata'!I$1,'2. Metadata'!I$5, IF(B136='2. Metadata'!J$1,'2. Metadata'!J$5, IF(B136='2. Metadata'!K$1,'2. Metadata'!K$5, IF(B136='2. Metadata'!L$1,'2. Metadata'!L$5, IF(B136='2. Metadata'!M$1,'2. Metadata'!M$5, IF(B136='2. Metadata'!N$1,'2. Metadata'!N$5))))))))))))))","v":49.97944},{"$f":"IF(ISBLANK(B136)=TRUE,\" \", IF(B136='2. Metadata'!B$1,'2. Metadata'!B$6, IF(B136='2. Metadata'!C$1,'2. Metadata'!C$6,IF(B136='2. Metadata'!D$1,'2. Metadata'!D$6, IF(B136='2. Metadata'!E$1,'2. Metadata'!E$6,IF( B136='2. Metadata'!F$1,'2. Metadata'!F$6,IF(B136='2. Metadata'!G$1,'2. Metadata'!G$6,IF(B136='2. Metadata'!H$1,'2. Metadata'!H$6, IF(B136='2. Metadata'!I$1,'2. Metadata'!I$6, IF(B136='2. Metadata'!J$1,'2. Metadata'!J$6, IF(B136='2. Metadata'!K$1,'2. Metadata'!K$6, IF(B136='2. Metadata'!L$1,'2. Metadata'!L$6, IF(B136='2. Metadata'!M$1,'2. Metadata'!M$6, IF(B136='2. Metadata'!N$1,'2. Metadata'!N$6))))))))))))))","v":-117.88417},"n/a",1.344,{"$f":"IF(ISBLANK(F136)=TRUE,\" \",'2. Metadata'!B$14)","v":"degrees Celsius"},-0.004,{"$f":"IF(ISBLANK(H136)=TRUE,\" \",'2. Metadata'!B$26)","v":"degrees Celsius"},0.651,{"$f":"IF(ISBLANK(J136)=TRUE,\" \",'2. Metadata'!B$38)","v":"degrees Celsius"},"n/a"]
["2013-12-17","NECAR01",{"$f":"IF(ISBLANK(B137)=TRUE,\" \", IF(B137='2. Metadata'!B$1,'2. Metadata'!B$5, IF(B137='2. Metadata'!C$1,'2. Metadata'!C$5,IF(B137='2. Metadata'!D$1,'2. Metadata'!D$5, IF(B137='2. Metadata'!E$1,'2. Metadata'!E$5,IF( B137='2. Metadata'!F$1,'2. Metadata'!F$5,IF(B137='2. Metadata'!G$1,'2. Metadata'!G$5,IF(B137='2. Metadata'!H$1,'2. Metadata'!H$5, IF(B137='2. Metadata'!I$1,'2. Metadata'!I$5, IF(B137='2. Metadata'!J$1,'2. Metadata'!J$5, IF(B137='2. Metadata'!K$1,'2. Metadata'!K$5, IF(B137='2. Metadata'!L$1,'2. Metadata'!L$5, IF(B137='2. Metadata'!M$1,'2. Metadata'!M$5, IF(B137='2. Metadata'!N$1,'2. Metadata'!N$5))))))))))))))","v":49.97944},{"$f":"IF(ISBLANK(B137)=TRUE,\" \", IF(B137='2. Metadata'!B$1,'2. Metadata'!B$6, IF(B137='2. Metadata'!C$1,'2. Metadata'!C$6,IF(B137='2. Metadata'!D$1,'2. Metadata'!D$6, IF(B137='2. Metadata'!E$1,'2. Metadata'!E$6,IF( B137='2. Metadata'!F$1,'2. Metadata'!F$6,IF(B137='2. Metadata'!G$1,'2. Metadata'!G$6,IF(B137='2. Metadata'!H$1,'2. Metadata'!H$6, IF(B137='2. Metadata'!I$1,'2. Metadata'!I$6, IF(B137='2. Metadata'!J$1,'2. Metadata'!J$6, IF(B137='2. Metadata'!K$1,'2. Metadata'!K$6, IF(B137='2. Metadata'!L$1,'2. Metadata'!L$6, IF(B137='2. Metadata'!M$1,'2. Metadata'!M$6, IF(B137='2. Metadata'!N$1,'2. Metadata'!N$6))))))))))))))","v":-117.88417},"n/a",1.588,{"$f":"IF(ISBLANK(F137)=TRUE,\" \",'2. Metadata'!B$14)","v":"degrees Celsius"},1.18,{"$f":"IF(ISBLANK(H137)=TRUE,\" \",'2. Metadata'!B$26)","v":"degrees Celsius"},1.359,{"$f":"IF(ISBLANK(J137)=TRUE,\" \",'2. Metadata'!B$38)","v":"degrees Celsius"},"n/a"]
["2013-12-18","NECAR01",{"$f":"IF(ISBLANK(B138)=TRUE,\" \", IF(B138='2. Metadata'!B$1,'2. Metadata'!B$5, IF(B138='2. Metadata'!C$1,'2. Metadata'!C$5,IF(B138='2. Metadata'!D$1,'2. Metadata'!D$5, IF(B138='2. Metadata'!E$1,'2. Metadata'!E$5,IF( B138='2. Metadata'!F$1,'2. Metadata'!F$5,IF(B138='2. Metadata'!G$1,'2. Metadata'!G$5,IF(B138='2. Metadata'!H$1,'2. Metadata'!H$5, IF(B138='2. Metadata'!I$1,'2. Metadata'!I$5, IF(B138='2. Metadata'!J$1,'2. Metadata'!J$5, IF(B138='2. Metadata'!K$1,'2. Metadata'!K$5, IF(B138='2. Metadata'!L$1,'2. Metadata'!L$5, IF(B138='2. Metadata'!M$1,'2. Metadata'!M$5, IF(B138='2. Metadata'!N$1,'2. Metadata'!N$5))))))))))))))","v":49.97944},{"$f":"IF(ISBLANK(B138)=TRUE,\" \", IF(B138='2. Metadata'!B$1,'2. Metadata'!B$6, IF(B138='2. Metadata'!C$1,'2. Metadata'!C$6,IF(B138='2. Metadata'!D$1,'2. Metadata'!D$6, IF(B138='2. Metadata'!E$1,'2. Metadata'!E$6,IF( B138='2. Metadata'!F$1,'2. Metadata'!F$6,IF(B138='2. Metadata'!G$1,'2. Metadata'!G$6,IF(B138='2. Metadata'!H$1,'2. Metadata'!H$6, IF(B138='2. Metadata'!I$1,'2. Metadata'!I$6, IF(B138='2. Metadata'!J$1,'2. Metadata'!J$6, IF(B138='2. Metadata'!K$1,'2. Metadata'!K$6, IF(B138='2. Metadata'!L$1,'2. Metadata'!L$6, IF(B138='2. Metadata'!M$1,'2. Metadata'!M$6, IF(B138='2. Metadata'!N$1,'2. Metadata'!N$6))))))))))))))","v":-117.88417},"n/a",1.778,{"$f":"IF(ISBLANK(F138)=TRUE,\" \",'2. Metadata'!B$14)","v":"degrees Celsius"},1.262,{"$f":"IF(ISBLANK(H138)=TRUE,\" \",'2. Metadata'!B$26)","v":"degrees Celsius"},1.493,{"$f":"IF(ISBLANK(J138)=TRUE,\" \",'2. Metadata'!B$38)","v":"degrees Celsius"},"n/a"]
["2013-12-19","NECAR01",{"$f":"IF(ISBLANK(B139)=TRUE,\" \", IF(B139='2. Metadata'!B$1,'2. Metadata'!B$5, IF(B139='2. Metadata'!C$1,'2. Metadata'!C$5,IF(B139='2. Metadata'!D$1,'2. Metadata'!D$5, IF(B139='2. Metadata'!E$1,'2. Metadata'!E$5,IF( B139='2. Metadata'!F$1,'2. Metadata'!F$5,IF(B139='2. Metadata'!G$1,'2. Metadata'!G$5,IF(B139='2. Metadata'!H$1,'2. Metadata'!H$5, IF(B139='2. Metadata'!I$1,'2. Metadata'!I$5, IF(B139='2. Metadata'!J$1,'2. Metadata'!J$5, IF(B139='2. Metadata'!K$1,'2. Metadata'!K$5, IF(B139='2. Metadata'!L$1,'2. Metadata'!L$5, IF(B139='2. Metadata'!M$1,'2. Metadata'!M$5, IF(B139='2. Metadata'!N$1,'2. Metadata'!N$5))))))))))))))","v":49.97944},{"$f":"IF(ISBLANK(B139)=TRUE,\" \", IF(B139='2. Metadata'!B$1,'2. Metadata'!B$6, IF(B139='2. Metadata'!C$1,'2. Metadata'!C$6,IF(B139='2. Metadata'!D$1,'2. Metadata'!D$6, IF(B139='2. Metadata'!E$1,'2. Metadata'!E$6,IF( B139='2. Metadata'!F$1,'2. Metadata'!F$6,IF(B139='2. Metadata'!G$1,'2. Metadata'!G$6,IF(B139='2. Metadata'!H$1,'2. Metadata'!H$6, IF(B139='2. Metadata'!I$1,'2. Metadata'!I$6, IF(B139='2. Metadata'!J$1,'2. Metadata'!J$6, IF(B139='2. Metadata'!K$1,'2. Metadata'!K$6, IF(B139='2. Metadata'!L$1,'2. Metadata'!L$6, IF(B139='2. Metadata'!M$1,'2. Metadata'!M$6, IF(B139='2. Metadata'!N$1,'2. Metadata'!N$6))))))))))))))","v":-117.88417},"n/a",1.235,{"$f":"IF(ISBLANK(F139)=TRUE,\" \",'2. Metadata'!B$14)","v":"degrees Celsius"},0.329,{"$f":"IF(ISBLANK(H139)=TRUE,\" \",'2. Metadata'!B$26)","v":"degrees Celsius"},0.67,{"$f":"IF(ISBLANK(J139)=TRUE,\" \",'2. Metadata'!B$38)","v":"degrees Celsius"},"n/a"]
["2013-12-20","NECAR01",{"$f":"IF(ISBLANK(B140)=TRUE,\" \", IF(B140='2. Metadata'!B$1,'2. Metadata'!B$5, IF(B140='2. Metadata'!C$1,'2. Metadata'!C$5,IF(B140='2. Metadata'!D$1,'2. Metadata'!D$5, IF(B140='2. Metadata'!E$1,'2. Metadata'!E$5,IF( B140='2. Metadata'!F$1,'2. Metadata'!F$5,IF(B140='2. Metadata'!G$1,'2. Metadata'!G$5,IF(B140='2. Metadata'!H$1,'2. Metadata'!H$5, IF(B140='2. Metadata'!I$1,'2. Metadata'!I$5, IF(B140='2. Metadata'!J$1,'2. Metadata'!J$5, IF(B140='2. Metadata'!K$1,'2. Metadata'!K$5, IF(B140='2. Metadata'!L$1,'2. Metadata'!L$5, IF(B140='2. Metadata'!M$1,'2. Metadata'!M$5, IF(B140='2. Metadata'!N$1,'2. Metadata'!N$5))))))))))))))","v":49.97944},{"$f":"IF(ISBLANK(B140)=TRUE,\" \", IF(B140='2. Metadata'!B$1,'2. Metadata'!B$6, IF(B140='2. Metadata'!C$1,'2. Metadata'!C$6,IF(B140='2. Metadata'!D$1,'2. Metadata'!D$6, IF(B140='2. Metadata'!E$1,'2. Metadata'!E$6,IF( B140='2. Metadata'!F$1,'2. Metadata'!F$6,IF(B140='2. Metadata'!G$1,'2. Metadata'!G$6,IF(B140='2. Metadata'!H$1,'2. Metadata'!H$6, IF(B140='2. Metadata'!I$1,'2. Metadata'!I$6, IF(B140='2. Metadata'!J$1,'2. Metadata'!J$6, IF(B140='2. Metadata'!K$1,'2. Metadata'!K$6, IF(B140='2. Metadata'!L$1,'2. Metadata'!L$6, IF(B140='2. Metadata'!M$1,'2. Metadata'!M$6, IF(B140='2. Metadata'!N$1,'2. Metadata'!N$6))))))))))))))","v":-117.88417},"n/a",0.329,{"$f":"IF(ISBLANK(F140)=TRUE,\" \",'2. Metadata'!B$14)","v":"degrees Celsius"},0.024,{"$f":"IF(ISBLANK(H140)=TRUE,\" \",'2. Metadata'!B$26)","v":"degrees Celsius"},0.2,{"$f":"IF(ISBLANK(J140)=TRUE,\" \",'2. Metadata'!B$38)","v":"degrees Celsius"},"n/a"]
["2013-12-21","NECAR01",{"$f":"IF(ISBLANK(B141)=TRUE,\" \", IF(B141='2. Metadata'!B$1,'2. Metadata'!B$5, IF(B141='2. Metadata'!C$1,'2. Metadata'!C$5,IF(B141='2. Metadata'!D$1,'2. Metadata'!D$5, IF(B141='2. Metadata'!E$1,'2. Metadata'!E$5,IF( B141='2. Metadata'!F$1,'2. Metadata'!F$5,IF(B141='2. Metadata'!G$1,'2. Metadata'!G$5,IF(B141='2. Metadata'!H$1,'2. Metadata'!H$5, IF(B141='2. Metadata'!I$1,'2. Metadata'!I$5, IF(B141='2. Metadata'!J$1,'2. Metadata'!J$5, IF(B141='2. Metadata'!K$1,'2. Metadata'!K$5, IF(B141='2. Metadata'!L$1,'2. Metadata'!L$5, IF(B141='2. Metadata'!M$1,'2. Metadata'!M$5, IF(B141='2. Metadata'!N$1,'2. Metadata'!N$5))))))))))))))","v":49.97944},{"$f":"IF(ISBLANK(B141)=TRUE,\" \", IF(B141='2. Metadata'!B$1,'2. Metadata'!B$6, IF(B141='2. Metadata'!C$1,'2. Metadata'!C$6,IF(B141='2. Metadata'!D$1,'2. Metadata'!D$6, IF(B141='2. Metadata'!E$1,'2. Metadata'!E$6,IF( B141='2. Metadata'!F$1,'2. Metadata'!F$6,IF(B141='2. Metadata'!G$1,'2. Metadata'!G$6,IF(B141='2. Metadata'!H$1,'2. Metadata'!H$6, IF(B141='2. Metadata'!I$1,'2. Metadata'!I$6, IF(B141='2. Metadata'!J$1,'2. Metadata'!J$6, IF(B141='2. Metadata'!K$1,'2. Metadata'!K$6, IF(B141='2. Metadata'!L$1,'2. Metadata'!L$6, IF(B141='2. Metadata'!M$1,'2. Metadata'!M$6, IF(B141='2. Metadata'!N$1,'2. Metadata'!N$6))))))))))))))","v":-117.88417},"n/a",0.852,{"$f":"IF(ISBLANK(F141)=TRUE,\" \",'2. Metadata'!B$14)","v":"degrees Celsius"},0.273,{"$f":"IF(ISBLANK(H141)=TRUE,\" \",'2. Metadata'!B$26)","v":"degrees Celsius"},0.522,{"$f":"IF(ISBLANK(J141)=TRUE,\" \",'2. Metadata'!B$38)","v":"degrees Celsius"},"n/a"]
["2013-12-22","NECAR01",{"$f":"IF(ISBLANK(B142)=TRUE,\" \", IF(B142='2. Metadata'!B$1,'2. Metadata'!B$5, IF(B142='2. Metadata'!C$1,'2. Metadata'!C$5,IF(B142='2. Metadata'!D$1,'2. Metadata'!D$5, IF(B142='2. Metadata'!E$1,'2. Metadata'!E$5,IF( B142='2. Metadata'!F$1,'2. Metadata'!F$5,IF(B142='2. Metadata'!G$1,'2. Metadata'!G$5,IF(B142='2. Metadata'!H$1,'2. Metadata'!H$5, IF(B142='2. Metadata'!I$1,'2. Metadata'!I$5, IF(B142='2. Metadata'!J$1,'2. Metadata'!J$5, IF(B142='2. Metadata'!K$1,'2. Metadata'!K$5, IF(B142='2. Metadata'!L$1,'2. Metadata'!L$5, IF(B142='2. Metadata'!M$1,'2. Metadata'!M$5, IF(B142='2. Metadata'!N$1,'2. Metadata'!N$5))))))))))))))","v":49.97944},{"$f":"IF(ISBLANK(B142)=TRUE,\" \", IF(B142='2. Metadata'!B$1,'2. Metadata'!B$6, IF(B142='2. Metadata'!C$1,'2. Metadata'!C$6,IF(B142='2. Metadata'!D$1,'2. Metadata'!D$6, IF(B142='2. Metadata'!E$1,'2. Metadata'!E$6,IF( B142='2. Metadata'!F$1,'2. Metadata'!F$6,IF(B142='2. Metadata'!G$1,'2. Metadata'!G$6,IF(B142='2. Metadata'!H$1,'2. Metadata'!H$6, IF(B142='2. Metadata'!I$1,'2. Metadata'!I$6, IF(B142='2. Metadata'!J$1,'2. Metadata'!J$6, IF(B142='2. Metadata'!K$1,'2. Metadata'!K$6, IF(B142='2. Metadata'!L$1,'2. Metadata'!L$6, IF(B142='2. Metadata'!M$1,'2. Metadata'!M$6, IF(B142='2. Metadata'!N$1,'2. Metadata'!N$6))))))))))))))","v":-117.88417},"n/a",1.262,{"$f":"IF(ISBLANK(F142)=TRUE,\" \",'2. Metadata'!B$14)","v":"degrees Celsius"},0.715,{"$f":"IF(ISBLANK(H142)=TRUE,\" \",'2. Metadata'!B$26)","v":"degrees Celsius"},0.953,{"$f":"IF(ISBLANK(J142)=TRUE,\" \",'2. Metadata'!B$38)","v":"degrees Celsius"},"n/a"]
["2013-12-23","NECAR01",{"$f":"IF(ISBLANK(B143)=TRUE,\" \", IF(B143='2. Metadata'!B$1,'2. Metadata'!B$5, IF(B143='2. Metadata'!C$1,'2. Metadata'!C$5,IF(B143='2. Metadata'!D$1,'2. Metadata'!D$5, IF(B143='2. Metadata'!E$1,'2. Metadata'!E$5,IF( B143='2. Metadata'!F$1,'2. Metadata'!F$5,IF(B143='2. Metadata'!G$1,'2. Metadata'!G$5,IF(B143='2. Metadata'!H$1,'2. Metadata'!H$5, IF(B143='2. Metadata'!I$1,'2. Metadata'!I$5, IF(B143='2. Metadata'!J$1,'2. Metadata'!J$5, IF(B143='2. Metadata'!K$1,'2. Metadata'!K$5, IF(B143='2. Metadata'!L$1,'2. Metadata'!L$5, IF(B143='2. Metadata'!M$1,'2. Metadata'!M$5, IF(B143='2. Metadata'!N$1,'2. Metadata'!N$5))))))))))))))","v":49.97944},{"$f":"IF(ISBLANK(B143)=TRUE,\" \", IF(B143='2. Metadata'!B$1,'2. Metadata'!B$6, IF(B143='2. Metadata'!C$1,'2. Metadata'!C$6,IF(B143='2. Metadata'!D$1,'2. Metadata'!D$6, IF(B143='2. Metadata'!E$1,'2. Metadata'!E$6,IF( B143='2. Metadata'!F$1,'2. Metadata'!F$6,IF(B143='2. Metadata'!G$1,'2. Metadata'!G$6,IF(B143='2. Metadata'!H$1,'2. Metadata'!H$6, IF(B143='2. Metadata'!I$1,'2. Metadata'!I$6, IF(B143='2. Metadata'!J$1,'2. Metadata'!J$6, IF(B143='2. Metadata'!K$1,'2. Metadata'!K$6, IF(B143='2. Metadata'!L$1,'2. Metadata'!L$6, IF(B143='2. Metadata'!M$1,'2. Metadata'!M$6, IF(B143='2. Metadata'!N$1,'2. Metadata'!N$6))))))))))))))","v":-117.88417},"n/a",1.425,{"$f":"IF(ISBLANK(F143)=TRUE,\" \",'2. Metadata'!B$14)","v":"degrees Celsius"},0.605,{"$f":"IF(ISBLANK(H143)=TRUE,\" \",'2. Metadata'!B$26)","v":"degrees Celsius"},1.112,{"$f":"IF(ISBLANK(J143)=TRUE,\" \",'2. Metadata'!B$38)","v":"degrees Celsius"},"n/a"]
["2013-12-24","NECAR01",{"$f":"IF(ISBLANK(B144)=TRUE,\" \", IF(B144='2. Metadata'!B$1,'2. Metadata'!B$5, IF(B144='2. Metadata'!C$1,'2. Metadata'!C$5,IF(B144='2. Metadata'!D$1,'2. Metadata'!D$5, IF(B144='2. Metadata'!E$1,'2. Metadata'!E$5,IF( B144='2. Metadata'!F$1,'2. Metadata'!F$5,IF(B144='2. Metadata'!G$1,'2. Metadata'!G$5,IF(B144='2. Metadata'!H$1,'2. Metadata'!H$5, IF(B144='2. Metadata'!I$1,'2. Metadata'!I$5, IF(B144='2. Metadata'!J$1,'2. Metadata'!J$5, IF(B144='2. Metadata'!K$1,'2. Metadata'!K$5, IF(B144='2. Metadata'!L$1,'2. Metadata'!L$5, IF(B144='2. Metadata'!M$1,'2. Metadata'!M$5, IF(B144='2. Metadata'!N$1,'2. Metadata'!N$5))))))))))))))","v":49.97944},{"$f":"IF(ISBLANK(B144)=TRUE,\" \", IF(B144='2. Metadata'!B$1,'2. Metadata'!B$6, IF(B144='2. Metadata'!C$1,'2. Metadata'!C$6,IF(B144='2. Metadata'!D$1,'2. Metadata'!D$6, IF(B144='2. Metadata'!E$1,'2. Metadata'!E$6,IF( B144='2. Metadata'!F$1,'2. Metadata'!F$6,IF(B144='2. Metadata'!G$1,'2. Metadata'!G$6,IF(B144='2. Metadata'!H$1,'2. Metadata'!H$6, IF(B144='2. Metadata'!I$1,'2. Metadata'!I$6, IF(B144='2. Metadata'!J$1,'2. Metadata'!J$6, IF(B144='2. Metadata'!K$1,'2. Metadata'!K$6, IF(B144='2. Metadata'!L$1,'2. Metadata'!L$6, IF(B144='2. Metadata'!M$1,'2. Metadata'!M$6, IF(B144='2. Metadata'!N$1,'2. Metadata'!N$6))))))))))))))","v":-117.88417},"n/a",1.859,{"$f":"IF(ISBLANK(F144)=TRUE,\" \",'2. Metadata'!B$14)","v":"degrees Celsius"},1.126,{"$f":"IF(ISBLANK(H144)=TRUE,\" \",'2. Metadata'!B$26)","v":"degrees Celsius"},1.366,{"$f":"IF(ISBLANK(J144)=TRUE,\" \",'2. Metadata'!B$38)","v":"degrees Celsius"},"n/a"]
["2013-12-25","NECAR01",{"$f":"IF(ISBLANK(B145)=TRUE,\" \", IF(B145='2. Metadata'!B$1,'2. Metadata'!B$5, IF(B145='2. Metadata'!C$1,'2. Metadata'!C$5,IF(B145='2. Metadata'!D$1,'2. Metadata'!D$5, IF(B145='2. Metadata'!E$1,'2. Metadata'!E$5,IF( B145='2. Metadata'!F$1,'2. Metadata'!F$5,IF(B145='2. Metadata'!G$1,'2. Metadata'!G$5,IF(B145='2. Metadata'!H$1,'2. Metadata'!H$5, IF(B145='2. Metadata'!I$1,'2. Metadata'!I$5, IF(B145='2. Metadata'!J$1,'2. Metadata'!J$5, IF(B145='2. Metadata'!K$1,'2. Metadata'!K$5, IF(B145='2. Metadata'!L$1,'2. Metadata'!L$5, IF(B145='2. Metadata'!M$1,'2. Metadata'!M$5, IF(B145='2. Metadata'!N$1,'2. Metadata'!N$5))))))))))))))","v":49.97944},{"$f":"IF(ISBLANK(B145)=TRUE,\" \", IF(B145='2. Metadata'!B$1,'2. Metadata'!B$6, IF(B145='2. Metadata'!C$1,'2. Metadata'!C$6,IF(B145='2. Metadata'!D$1,'2. Metadata'!D$6, IF(B145='2. Metadata'!E$1,'2. Metadata'!E$6,IF( B145='2. Metadata'!F$1,'2. Metadata'!F$6,IF(B145='2. Metadata'!G$1,'2. Metadata'!G$6,IF(B145='2. Metadata'!H$1,'2. Metadata'!H$6, IF(B145='2. Metadata'!I$1,'2. Metadata'!I$6, IF(B145='2. Metadata'!J$1,'2. Metadata'!J$6, IF(B145='2. Metadata'!K$1,'2. Metadata'!K$6, IF(B145='2. Metadata'!L$1,'2. Metadata'!L$6, IF(B145='2. Metadata'!M$1,'2. Metadata'!M$6, IF(B145='2. Metadata'!N$1,'2. Metadata'!N$6))))))))))))))","v":-117.88417},"n/a",1.208,{"$f":"IF(ISBLANK(F145)=TRUE,\" \",'2. Metadata'!B$14)","v":"degrees Celsius"},0.907,{"$f":"IF(ISBLANK(H145)=TRUE,\" \",'2. Metadata'!B$26)","v":"degrees Celsius"},1.062,{"$f":"IF(ISBLANK(J145)=TRUE,\" \",'2. Metadata'!B$38)","v":"degrees Celsius"},"n/a"]
["2013-12-26","NECAR01",{"$f":"IF(ISBLANK(B146)=TRUE,\" \", IF(B146='2. Metadata'!B$1,'2. Metadata'!B$5, IF(B146='2. Metadata'!C$1,'2. Metadata'!C$5,IF(B146='2. Metadata'!D$1,'2. Metadata'!D$5, IF(B146='2. Metadata'!E$1,'2. Metadata'!E$5,IF( B146='2. Metadata'!F$1,'2. Metadata'!F$5,IF(B146='2. Metadata'!G$1,'2. Metadata'!G$5,IF(B146='2. Metadata'!H$1,'2. Metadata'!H$5, IF(B146='2. Metadata'!I$1,'2. Metadata'!I$5, IF(B146='2. Metadata'!J$1,'2. Metadata'!J$5, IF(B146='2. Metadata'!K$1,'2. Metadata'!K$5, IF(B146='2. Metadata'!L$1,'2. Metadata'!L$5, IF(B146='2. Metadata'!M$1,'2. Metadata'!M$5, IF(B146='2. Metadata'!N$1,'2. Metadata'!N$5))))))))))))))","v":49.97944},{"$f":"IF(ISBLANK(B146)=TRUE,\" \", IF(B146='2. Metadata'!B$1,'2. Metadata'!B$6, IF(B146='2. Metadata'!C$1,'2. Metadata'!C$6,IF(B146='2. Metadata'!D$1,'2. Metadata'!D$6, IF(B146='2. Metadata'!E$1,'2. Metadata'!E$6,IF( B146='2. Metadata'!F$1,'2. Metadata'!F$6,IF(B146='2. Metadata'!G$1,'2. Metadata'!G$6,IF(B146='2. Metadata'!H$1,'2. Metadata'!H$6, IF(B146='2. Metadata'!I$1,'2. Metadata'!I$6, IF(B146='2. Metadata'!J$1,'2. Metadata'!J$6, IF(B146='2. Metadata'!K$1,'2. Metadata'!K$6, IF(B146='2. Metadata'!L$1,'2. Metadata'!L$6, IF(B146='2. Metadata'!M$1,'2. Metadata'!M$6, IF(B146='2. Metadata'!N$1,'2. Metadata'!N$6))))))))))))))","v":-117.88417},"n/a",1.044,{"$f":"IF(ISBLANK(F146)=TRUE,\" \",'2. Metadata'!B$14)","v":"degrees Celsius"},0.163,{"$f":"IF(ISBLANK(H146)=TRUE,\" \",'2. Metadata'!B$26)","v":"degrees Celsius"},0.778,{"$f":"IF(ISBLANK(J146)=TRUE,\" \",'2. Metadata'!B$38)","v":"degrees Celsius"},"n/a"]
["2013-12-27","NECAR01",{"$f":"IF(ISBLANK(B147)=TRUE,\" \", IF(B147='2. Metadata'!B$1,'2. Metadata'!B$5, IF(B147='2. Metadata'!C$1,'2. Metadata'!C$5,IF(B147='2. Metadata'!D$1,'2. Metadata'!D$5, IF(B147='2. Metadata'!E$1,'2. Metadata'!E$5,IF( B147='2. Metadata'!F$1,'2. Metadata'!F$5,IF(B147='2. Metadata'!G$1,'2. Metadata'!G$5,IF(B147='2. Metadata'!H$1,'2. Metadata'!H$5, IF(B147='2. Metadata'!I$1,'2. Metadata'!I$5, IF(B147='2. Metadata'!J$1,'2. Metadata'!J$5, IF(B147='2. Metadata'!K$1,'2. Metadata'!K$5, IF(B147='2. Metadata'!L$1,'2. Metadata'!L$5, IF(B147='2. Metadata'!M$1,'2. Metadata'!M$5, IF(B147='2. Metadata'!N$1,'2. Metadata'!N$5))))))))))))))","v":49.97944},{"$f":"IF(ISBLANK(B147)=TRUE,\" \", IF(B147='2. Metadata'!B$1,'2. Metadata'!B$6, IF(B147='2. Metadata'!C$1,'2. Metadata'!C$6,IF(B147='2. Metadata'!D$1,'2. Metadata'!D$6, IF(B147='2. Metadata'!E$1,'2. Metadata'!E$6,IF( B147='2. Metadata'!F$1,'2. Metadata'!F$6,IF(B147='2. Metadata'!G$1,'2. Metadata'!G$6,IF(B147='2. Metadata'!H$1,'2. Metadata'!H$6, IF(B147='2. Metadata'!I$1,'2. Metadata'!I$6, IF(B147='2. Metadata'!J$1,'2. Metadata'!J$6, IF(B147='2. Metadata'!K$1,'2. Metadata'!K$6, IF(B147='2. Metadata'!L$1,'2. Metadata'!L$6, IF(B147='2. Metadata'!M$1,'2. Metadata'!M$6, IF(B147='2. Metadata'!N$1,'2. Metadata'!N$6))))))))))))))","v":-117.88417},"n/a",1.344,{"$f":"IF(ISBLANK(F147)=TRUE,\" \",'2. Metadata'!B$14)","v":"degrees Celsius"},0.852,{"$f":"IF(ISBLANK(H147)=TRUE,\" \",'2. Metadata'!B$26)","v":"degrees Celsius"},1.138,{"$f":"IF(ISBLANK(J147)=TRUE,\" \",'2. Metadata'!B$38)","v":"degrees Celsius"},"n/a"]
["2013-12-28","NECAR01",{"$f":"IF(ISBLANK(B148)=TRUE,\" \", IF(B148='2. Metadata'!B$1,'2. Metadata'!B$5, IF(B148='2. Metadata'!C$1,'2. Metadata'!C$5,IF(B148='2. Metadata'!D$1,'2. Metadata'!D$5, IF(B148='2. Metadata'!E$1,'2. Metadata'!E$5,IF( B148='2. Metadata'!F$1,'2. Metadata'!F$5,IF(B148='2. Metadata'!G$1,'2. Metadata'!G$5,IF(B148='2. Metadata'!H$1,'2. Metadata'!H$5, IF(B148='2. Metadata'!I$1,'2. Metadata'!I$5, IF(B148='2. Metadata'!J$1,'2. Metadata'!J$5, IF(B148='2. Metadata'!K$1,'2. Metadata'!K$5, IF(B148='2. Metadata'!L$1,'2. Metadata'!L$5, IF(B148='2. Metadata'!M$1,'2. Metadata'!M$5, IF(B148='2. Metadata'!N$1,'2. Metadata'!N$5))))))))))))))","v":49.97944},{"$f":"IF(ISBLANK(B148)=TRUE,\" \", IF(B148='2. Metadata'!B$1,'2. Metadata'!B$6, IF(B148='2. Metadata'!C$1,'2. Metadata'!C$6,IF(B148='2. Metadata'!D$1,'2. Metadata'!D$6, IF(B148='2. Metadata'!E$1,'2. Metadata'!E$6,IF( B148='2. Metadata'!F$1,'2. Metadata'!F$6,IF(B148='2. Metadata'!G$1,'2. Metadata'!G$6,IF(B148='2. Metadata'!H$1,'2. Metadata'!H$6, IF(B148='2. Metadata'!I$1,'2. Metadata'!I$6, IF(B148='2. Metadata'!J$1,'2. Metadata'!J$6, IF(B148='2. Metadata'!K$1,'2. Metadata'!K$6, IF(B148='2. Metadata'!L$1,'2. Metadata'!L$6, IF(B148='2. Metadata'!M$1,'2. Metadata'!M$6, IF(B148='2. Metadata'!N$1,'2. Metadata'!N$6))))))))))))))","v":-117.88417},"n/a",1.805,{"$f":"IF(ISBLANK(F148)=TRUE,\" \",'2. Metadata'!B$14)","v":"degrees Celsius"},1.235,{"$f":"IF(ISBLANK(H148)=TRUE,\" \",'2. Metadata'!B$26)","v":"degrees Celsius"},1.409,{"$f":"IF(ISBLANK(J148)=TRUE,\" \",'2. Metadata'!B$38)","v":"degrees Celsius"},"n/a"]
["2013-12-29","NECAR01",{"$f":"IF(ISBLANK(B149)=TRUE,\" \", IF(B149='2. Metadata'!B$1,'2. Metadata'!B$5, IF(B149='2. Metadata'!C$1,'2. Metadata'!C$5,IF(B149='2. Metadata'!D$1,'2. Metadata'!D$5, IF(B149='2. Metadata'!E$1,'2. Metadata'!E$5,IF( B149='2. Metadata'!F$1,'2. Metadata'!F$5,IF(B149='2. Metadata'!G$1,'2. Metadata'!G$5,IF(B149='2. Metadata'!H$1,'2. Metadata'!H$5, IF(B149='2. Metadata'!I$1,'2. Metadata'!I$5, IF(B149='2. Metadata'!J$1,'2. Metadata'!J$5, IF(B149='2. Metadata'!K$1,'2. Metadata'!K$5, IF(B149='2. Metadata'!L$1,'2. Metadata'!L$5, IF(B149='2. Metadata'!M$1,'2. Metadata'!M$5, IF(B149='2. Metadata'!N$1,'2. Metadata'!N$5))))))))))))))","v":49.97944},{"$f":"IF(ISBLANK(B149)=TRUE,\" \", IF(B149='2. Metadata'!B$1,'2. Metadata'!B$6, IF(B149='2. Metadata'!C$1,'2. Metadata'!C$6,IF(B149='2. Metadata'!D$1,'2. Metadata'!D$6, IF(B149='2. Metadata'!E$1,'2. Metadata'!E$6,IF( B149='2. Metadata'!F$1,'2. Metadata'!F$6,IF(B149='2. Metadata'!G$1,'2. Metadata'!G$6,IF(B149='2. Metadata'!H$1,'2. Metadata'!H$6, IF(B149='2. Metadata'!I$1,'2. Metadata'!I$6, IF(B149='2. Metadata'!J$1,'2. Metadata'!J$6, IF(B149='2. Metadata'!K$1,'2. Metadata'!K$6, IF(B149='2. Metadata'!L$1,'2. Metadata'!L$6, IF(B149='2. Metadata'!M$1,'2. Metadata'!M$6, IF(B149='2. Metadata'!N$1,'2. Metadata'!N$6))))))))))))))","v":-117.88417},"n/a",1.371,{"$f":"IF(ISBLANK(F149)=TRUE,\" \",'2. Metadata'!B$14)","v":"degrees Celsius"},0.852,{"$f":"IF(ISBLANK(H149)=TRUE,\" \",'2. Metadata'!B$26)","v":"degrees Celsius"},1.218,{"$f":"IF(ISBLANK(J149)=TRUE,\" \",'2. Metadata'!B$38)","v":"degrees Celsius"},"n/a"]
["2013-12-30","NECAR01",{"$f":"IF(ISBLANK(B150)=TRUE,\" \", IF(B150='2. Metadata'!B$1,'2. Metadata'!B$5, IF(B150='2. Metadata'!C$1,'2. Metadata'!C$5,IF(B150='2. Metadata'!D$1,'2. Metadata'!D$5, IF(B150='2. Metadata'!E$1,'2. Metadata'!E$5,IF( B150='2. Metadata'!F$1,'2. Metadata'!F$5,IF(B150='2. Metadata'!G$1,'2. Metadata'!G$5,IF(B150='2. Metadata'!H$1,'2. Metadata'!H$5, IF(B150='2. Metadata'!I$1,'2. Metadata'!I$5, IF(B150='2. Metadata'!J$1,'2. Metadata'!J$5, IF(B150='2. Metadata'!K$1,'2. Metadata'!K$5, IF(B150='2. Metadata'!L$1,'2. Metadata'!L$5, IF(B150='2. Metadata'!M$1,'2. Metadata'!M$5, IF(B150='2. Metadata'!N$1,'2. Metadata'!N$5))))))))))))))","v":49.97944},{"$f":"IF(ISBLANK(B150)=TRUE,\" \", IF(B150='2. Metadata'!B$1,'2. Metadata'!B$6, IF(B150='2. Metadata'!C$1,'2. Metadata'!C$6,IF(B150='2. Metadata'!D$1,'2. Metadata'!D$6, IF(B150='2. Metadata'!E$1,'2. Metadata'!E$6,IF( B150='2. Metadata'!F$1,'2. Metadata'!F$6,IF(B150='2. Metadata'!G$1,'2. Metadata'!G$6,IF(B150='2. Metadata'!H$1,'2. Metadata'!H$6, IF(B150='2. Metadata'!I$1,'2. Metadata'!I$6, IF(B150='2. Metadata'!J$1,'2. Metadata'!J$6, IF(B150='2. Metadata'!K$1,'2. Metadata'!K$6, IF(B150='2. Metadata'!L$1,'2. Metadata'!L$6, IF(B150='2. Metadata'!M$1,'2. Metadata'!M$6, IF(B150='2. Metadata'!N$1,'2. Metadata'!N$6))))))))))))))","v":-117.88417},"n/a",1.425,{"$f":"IF(ISBLANK(F150)=TRUE,\" \",'2. Metadata'!B$14)","v":"degrees Celsius"},0.989,{"$f":"IF(ISBLANK(H150)=TRUE,\" \",'2. Metadata'!B$26)","v":"degrees Celsius"},1.184,{"$f":"IF(ISBLANK(J150)=TRUE,\" \",'2. Metadata'!B$38)","v":"degrees Celsius"},"n/a"]
["2013-12-31","NECAR01",{"$f":"IF(ISBLANK(B151)=TRUE,\" \", IF(B151='2. Metadata'!B$1,'2. Metadata'!B$5, IF(B151='2. Metadata'!C$1,'2. Metadata'!C$5,IF(B151='2. Metadata'!D$1,'2. Metadata'!D$5, IF(B151='2. Metadata'!E$1,'2. Metadata'!E$5,IF( B151='2. Metadata'!F$1,'2. Metadata'!F$5,IF(B151='2. Metadata'!G$1,'2. Metadata'!G$5,IF(B151='2. Metadata'!H$1,'2. Metadata'!H$5, IF(B151='2. Metadata'!I$1,'2. Metadata'!I$5, IF(B151='2. Metadata'!J$1,'2. Metadata'!J$5, IF(B151='2. Metadata'!K$1,'2. Metadata'!K$5, IF(B151='2. Metadata'!L$1,'2. Metadata'!L$5, IF(B151='2. Metadata'!M$1,'2. Metadata'!M$5, IF(B151='2. Metadata'!N$1,'2. Metadata'!N$5))))))))))))))","v":49.97944},{"$f":"IF(ISBLANK(B151)=TRUE,\" \", IF(B151='2. Metadata'!B$1,'2. Metadata'!B$6, IF(B151='2. Metadata'!C$1,'2. Metadata'!C$6,IF(B151='2. Metadata'!D$1,'2. Metadata'!D$6, IF(B151='2. Metadata'!E$1,'2. Metadata'!E$6,IF( B151='2. Metadata'!F$1,'2. Metadata'!F$6,IF(B151='2. Metadata'!G$1,'2. Metadata'!G$6,IF(B151='2. Metadata'!H$1,'2. Metadata'!H$6, IF(B151='2. Metadata'!I$1,'2. Metadata'!I$6, IF(B151='2. Metadata'!J$1,'2. Metadata'!J$6, IF(B151='2. Metadata'!K$1,'2. Metadata'!K$6, IF(B151='2. Metadata'!L$1,'2. Metadata'!L$6, IF(B151='2. Metadata'!M$1,'2. Metadata'!M$6, IF(B151='2. Metadata'!N$1,'2. Metadata'!N$6))))))))))))))","v":-117.88417},"n/a",1.886,{"$f":"IF(ISBLANK(F151)=TRUE,\" \",'2. Metadata'!B$14)","v":"degrees Celsius"},1.289,{"$f":"IF(ISBLANK(H151)=TRUE,\" \",'2. Metadata'!B$26)","v":"degrees Celsius"},1.515,{"$f":"IF(ISBLANK(J151)=TRUE,\" \",'2. Metadata'!B$38)","v":"degrees Celsius"},"n/a"]
["2014-01-01","NECAR01",{"$f":"IF(ISBLANK(B152)=TRUE,\" \", IF(B152='2. Metadata'!B$1,'2. Metadata'!B$5, IF(B152='2. Metadata'!C$1,'2. Metadata'!C$5,IF(B152='2. Metadata'!D$1,'2. Metadata'!D$5, IF(B152='2. Metadata'!E$1,'2. Metadata'!E$5,IF( B152='2. Metadata'!F$1,'2. Metadata'!F$5,IF(B152='2. Metadata'!G$1,'2. Metadata'!G$5,IF(B152='2. Metadata'!H$1,'2. Metadata'!H$5, IF(B152='2. Metadata'!I$1,'2. Metadata'!I$5, IF(B152='2. Metadata'!J$1,'2. Metadata'!J$5, IF(B152='2. Metadata'!K$1,'2. Metadata'!K$5, IF(B152='2. Metadata'!L$1,'2. Metadata'!L$5, IF(B152='2. Metadata'!M$1,'2. Metadata'!M$5, IF(B152='2. Metadata'!N$1,'2. Metadata'!N$5))))))))))))))","v":49.97944},{"$f":"IF(ISBLANK(B152)=TRUE,\" \", IF(B152='2. Metadata'!B$1,'2. Metadata'!B$6, IF(B152='2. Metadata'!C$1,'2. Metadata'!C$6,IF(B152='2. Metadata'!D$1,'2. Metadata'!D$6, IF(B152='2. Metadata'!E$1,'2. Metadata'!E$6,IF( B152='2. Metadata'!F$1,'2. Metadata'!F$6,IF(B152='2. Metadata'!G$1,'2. Metadata'!G$6,IF(B152='2. Metadata'!H$1,'2. Metadata'!H$6, IF(B152='2. Metadata'!I$1,'2. Metadata'!I$6, IF(B152='2. Metadata'!J$1,'2. Metadata'!J$6, IF(B152='2. Metadata'!K$1,'2. Metadata'!K$6, IF(B152='2. Metadata'!L$1,'2. Metadata'!L$6, IF(B152='2. Metadata'!M$1,'2. Metadata'!M$6, IF(B152='2. Metadata'!N$1,'2. Metadata'!N$6))))))))))))))","v":-117.88417},"n/a",1.913,{"$f":"IF(ISBLANK(F152)=TRUE,\" \",'2. Metadata'!B$14)","v":"degrees Celsius"},1.561,{"$f":"IF(ISBLANK(H152)=TRUE,\" \",'2. Metadata'!B$26)","v":"degrees Celsius"},1.714,{"$f":"IF(ISBLANK(J152)=TRUE,\" \",'2. Metadata'!B$38)","v":"degrees Celsius"},"n/a"]
["2014-01-02","NECAR01",{"$f":"IF(ISBLANK(B153)=TRUE,\" \", IF(B153='2. Metadata'!B$1,'2. Metadata'!B$5, IF(B153='2. Metadata'!C$1,'2. Metadata'!C$5,IF(B153='2. Metadata'!D$1,'2. Metadata'!D$5, IF(B153='2. Metadata'!E$1,'2. Metadata'!E$5,IF( B153='2. Metadata'!F$1,'2. Metadata'!F$5,IF(B153='2. Metadata'!G$1,'2. Metadata'!G$5,IF(B153='2. Metadata'!H$1,'2. Metadata'!H$5, IF(B153='2. Metadata'!I$1,'2. Metadata'!I$5, IF(B153='2. Metadata'!J$1,'2. Metadata'!J$5, IF(B153='2. Metadata'!K$1,'2. Metadata'!K$5, IF(B153='2. Metadata'!L$1,'2. Metadata'!L$5, IF(B153='2. Metadata'!M$1,'2. Metadata'!M$5, IF(B153='2. Metadata'!N$1,'2. Metadata'!N$5))))))))))))))","v":49.97944},{"$f":"IF(ISBLANK(B153)=TRUE,\" \", IF(B153='2. Metadata'!B$1,'2. Metadata'!B$6, IF(B153='2. Metadata'!C$1,'2. Metadata'!C$6,IF(B153='2. Metadata'!D$1,'2. Metadata'!D$6, IF(B153='2. Metadata'!E$1,'2. Metadata'!E$6,IF( B153='2. Metadata'!F$1,'2. Metadata'!F$6,IF(B153='2. Metadata'!G$1,'2. Metadata'!G$6,IF(B153='2. Metadata'!H$1,'2. Metadata'!H$6, IF(B153='2. Metadata'!I$1,'2. Metadata'!I$6, IF(B153='2. Metadata'!J$1,'2. Metadata'!J$6, IF(B153='2. Metadata'!K$1,'2. Metadata'!K$6, IF(B153='2. Metadata'!L$1,'2. Metadata'!L$6, IF(B153='2. Metadata'!M$1,'2. Metadata'!M$6, IF(B153='2. Metadata'!N$1,'2. Metadata'!N$6))))))))))))))","v":-117.88417},"n/a",1.615,{"$f":"IF(ISBLANK(F153)=TRUE,\" \",'2. Metadata'!B$14)","v":"degrees Celsius"},0.495,{"$f":"IF(ISBLANK(H153)=TRUE,\" \",'2. Metadata'!B$26)","v":"degrees Celsius"},1.124,{"$f":"IF(ISBLANK(J153)=TRUE,\" \",'2. Metadata'!B$38)","v":"degrees Celsius"},"n/a"]
["2014-01-03","NECAR01",{"$f":"IF(ISBLANK(B154)=TRUE,\" \", IF(B154='2. Metadata'!B$1,'2. Metadata'!B$5, IF(B154='2. Metadata'!C$1,'2. Metadata'!C$5,IF(B154='2. Metadata'!D$1,'2. Metadata'!D$5, IF(B154='2. Metadata'!E$1,'2. Metadata'!E$5,IF( B154='2. Metadata'!F$1,'2. Metadata'!F$5,IF(B154='2. Metadata'!G$1,'2. Metadata'!G$5,IF(B154='2. Metadata'!H$1,'2. Metadata'!H$5, IF(B154='2. Metadata'!I$1,'2. Metadata'!I$5, IF(B154='2. Metadata'!J$1,'2. Metadata'!J$5, IF(B154='2. Metadata'!K$1,'2. Metadata'!K$5, IF(B154='2. Metadata'!L$1,'2. Metadata'!L$5, IF(B154='2. Metadata'!M$1,'2. Metadata'!M$5, IF(B154='2. Metadata'!N$1,'2. Metadata'!N$5))))))))))))))","v":49.97944},{"$f":"IF(ISBLANK(B154)=TRUE,\" \", IF(B154='2. Metadata'!B$1,'2. Metadata'!B$6, IF(B154='2. Metadata'!C$1,'2. Metadata'!C$6,IF(B154='2. Metadata'!D$1,'2. Metadata'!D$6, IF(B154='2. Metadata'!E$1,'2. Metadata'!E$6,IF( B154='2. Metadata'!F$1,'2. Metadata'!F$6,IF(B154='2. Metadata'!G$1,'2. Metadata'!G$6,IF(B154='2. Metadata'!H$1,'2. Metadata'!H$6, IF(B154='2. Metadata'!I$1,'2. Metadata'!I$6, IF(B154='2. Metadata'!J$1,'2. Metadata'!J$6, IF(B154='2. Metadata'!K$1,'2. Metadata'!K$6, IF(B154='2. Metadata'!L$1,'2. Metadata'!L$6, IF(B154='2. Metadata'!M$1,'2. Metadata'!M$6, IF(B154='2. Metadata'!N$1,'2. Metadata'!N$6))))))))))))))","v":-117.88417},"n/a",1.561,{"$f":"IF(ISBLANK(F154)=TRUE,\" \",'2. Metadata'!B$14)","v":"degrees Celsius"},0.989,{"$f":"IF(ISBLANK(H154)=TRUE,\" \",'2. Metadata'!B$26)","v":"degrees Celsius"},1.203,{"$f":"IF(ISBLANK(J154)=TRUE,\" \",'2. Metadata'!B$38)","v":"degrees Celsius"},"n/a"]
["2014-01-04","NECAR01",{"$f":"IF(ISBLANK(B155)=TRUE,\" \", IF(B155='2. Metadata'!B$1,'2. Metadata'!B$5, IF(B155='2. Metadata'!C$1,'2. Metadata'!C$5,IF(B155='2. Metadata'!D$1,'2. Metadata'!D$5, IF(B155='2. Metadata'!E$1,'2. Metadata'!E$5,IF( B155='2. Metadata'!F$1,'2. Metadata'!F$5,IF(B155='2. Metadata'!G$1,'2. Metadata'!G$5,IF(B155='2. Metadata'!H$1,'2. Metadata'!H$5, IF(B155='2. Metadata'!I$1,'2. Metadata'!I$5, IF(B155='2. Metadata'!J$1,'2. Metadata'!J$5, IF(B155='2. Metadata'!K$1,'2. Metadata'!K$5, IF(B155='2. Metadata'!L$1,'2. Metadata'!L$5, IF(B155='2. Metadata'!M$1,'2. Metadata'!M$5, IF(B155='2. Metadata'!N$1,'2. Metadata'!N$5))))))))))))))","v":49.97944},{"$f":"IF(ISBLANK(B155)=TRUE,\" \", IF(B155='2. Metadata'!B$1,'2. Metadata'!B$6, IF(B155='2. Metadata'!C$1,'2. Metadata'!C$6,IF(B155='2. Metadata'!D$1,'2. Metadata'!D$6, IF(B155='2. Metadata'!E$1,'2. Metadata'!E$6,IF( B155='2. Metadata'!F$1,'2. Metadata'!F$6,IF(B155='2. Metadata'!G$1,'2. Metadata'!G$6,IF(B155='2. Metadata'!H$1,'2. Metadata'!H$6, IF(B155='2. Metadata'!I$1,'2. Metadata'!I$6, IF(B155='2. Metadata'!J$1,'2. Metadata'!J$6, IF(B155='2. Metadata'!K$1,'2. Metadata'!K$6, IF(B155='2. Metadata'!L$1,'2. Metadata'!L$6, IF(B155='2. Metadata'!M$1,'2. Metadata'!M$6, IF(B155='2. Metadata'!N$1,'2. Metadata'!N$6))))))))))))))","v":-117.88417},"n/a",1.289,{"$f":"IF(ISBLANK(F155)=TRUE,\" \",'2. Metadata'!B$14)","v":"degrees Celsius"},0.273,{"$f":"IF(ISBLANK(H155)=TRUE,\" \",'2. Metadata'!B$26)","v":"degrees Celsius"},0.84,{"$f":"IF(ISBLANK(J155)=TRUE,\" \",'2. Metadata'!B$38)","v":"degrees Celsius"},"n/a"]
["2014-01-05","NECAR01",{"$f":"IF(ISBLANK(B156)=TRUE,\" \", IF(B156='2. Metadata'!B$1,'2. Metadata'!B$5, IF(B156='2. Metadata'!C$1,'2. Metadata'!C$5,IF(B156='2. Metadata'!D$1,'2. Metadata'!D$5, IF(B156='2. Metadata'!E$1,'2. Metadata'!E$5,IF( B156='2. Metadata'!F$1,'2. Metadata'!F$5,IF(B156='2. Metadata'!G$1,'2. Metadata'!G$5,IF(B156='2. Metadata'!H$1,'2. Metadata'!H$5, IF(B156='2. Metadata'!I$1,'2. Metadata'!I$5, IF(B156='2. Metadata'!J$1,'2. Metadata'!J$5, IF(B156='2. Metadata'!K$1,'2. Metadata'!K$5, IF(B156='2. Metadata'!L$1,'2. Metadata'!L$5, IF(B156='2. Metadata'!M$1,'2. Metadata'!M$5, IF(B156='2. Metadata'!N$1,'2. Metadata'!N$5))))))))))))))","v":49.97944},{"$f":"IF(ISBLANK(B156)=TRUE,\" \", IF(B156='2. Metadata'!B$1,'2. Metadata'!B$6, IF(B156='2. Metadata'!C$1,'2. Metadata'!C$6,IF(B156='2. Metadata'!D$1,'2. Metadata'!D$6, IF(B156='2. Metadata'!E$1,'2. Metadata'!E$6,IF( B156='2. Metadata'!F$1,'2. Metadata'!F$6,IF(B156='2. Metadata'!G$1,'2. Metadata'!G$6,IF(B156='2. Metadata'!H$1,'2. Metadata'!H$6, IF(B156='2. Metadata'!I$1,'2. Metadata'!I$6, IF(B156='2. Metadata'!J$1,'2. Metadata'!J$6, IF(B156='2. Metadata'!K$1,'2. Metadata'!K$6, IF(B156='2. Metadata'!L$1,'2. Metadata'!L$6, IF(B156='2. Metadata'!M$1,'2. Metadata'!M$6, IF(B156='2. Metadata'!N$1,'2. Metadata'!N$6))))))))))))))","v":-117.88417},"n/a",0.19,{"$f":"IF(ISBLANK(F156)=TRUE,\" \",'2. Metadata'!B$14)","v":"degrees Celsius"},-0.032,{"$f":"IF(ISBLANK(H156)=TRUE,\" \",'2. Metadata'!B$26)","v":"degrees Celsius"},-0.008,{"$f":"IF(ISBLANK(J156)=TRUE,\" \",'2. Metadata'!B$38)","v":"degrees Celsius"},"n/a"]
["2014-01-06","NECAR01",{"$f":"IF(ISBLANK(B157)=TRUE,\" \", IF(B157='2. Metadata'!B$1,'2. Metadata'!B$5, IF(B157='2. Metadata'!C$1,'2. Metadata'!C$5,IF(B157='2. Metadata'!D$1,'2. Metadata'!D$5, IF(B157='2. Metadata'!E$1,'2. Metadata'!E$5,IF( B157='2. Metadata'!F$1,'2. Metadata'!F$5,IF(B157='2. Metadata'!G$1,'2. Metadata'!G$5,IF(B157='2. Metadata'!H$1,'2. Metadata'!H$5, IF(B157='2. Metadata'!I$1,'2. Metadata'!I$5, IF(B157='2. Metadata'!J$1,'2. Metadata'!J$5, IF(B157='2. Metadata'!K$1,'2. Metadata'!K$5, IF(B157='2. Metadata'!L$1,'2. Metadata'!L$5, IF(B157='2. Metadata'!M$1,'2. Metadata'!M$5, IF(B157='2. Metadata'!N$1,'2. Metadata'!N$5))))))))))))))","v":49.97944},{"$f":"IF(ISBLANK(B157)=TRUE,\" \", IF(B157='2. Metadata'!B$1,'2. Metadata'!B$6, IF(B157='2. Metadata'!C$1,'2. Metadata'!C$6,IF(B157='2. Metadata'!D$1,'2. Metadata'!D$6, IF(B157='2. Metadata'!E$1,'2. Metadata'!E$6,IF( B157='2. Metadata'!F$1,'2. Metadata'!F$6,IF(B157='2. Metadata'!G$1,'2. Metadata'!G$6,IF(B157='2. Metadata'!H$1,'2. Metadata'!H$6, IF(B157='2. Metadata'!I$1,'2. Metadata'!I$6, IF(B157='2. Metadata'!J$1,'2. Metadata'!J$6, IF(B157='2. Metadata'!K$1,'2. Metadata'!K$6, IF(B157='2. Metadata'!L$1,'2. Metadata'!L$6, IF(B157='2. Metadata'!M$1,'2. Metadata'!M$6, IF(B157='2. Metadata'!N$1,'2. Metadata'!N$6))))))))))))))","v":-117.88417},"n/a",-0.004,{"$f":"IF(ISBLANK(F157)=TRUE,\" \",'2. Metadata'!B$14)","v":"degrees Celsius"},-0.032,{"$f":"IF(ISBLANK(H157)=TRUE,\" \",'2. Metadata'!B$26)","v":"degrees Celsius"},-0.007,{"$f":"IF(ISBLANK(J157)=TRUE,\" \",'2. Metadata'!B$38)","v":"degrees Celsius"},"n/a"]
["2014-01-07","NECAR01",{"$f":"IF(ISBLANK(B158)=TRUE,\" \", IF(B158='2. Metadata'!B$1,'2. Metadata'!B$5, IF(B158='2. Metadata'!C$1,'2. Metadata'!C$5,IF(B158='2. Metadata'!D$1,'2. Metadata'!D$5, IF(B158='2. Metadata'!E$1,'2. Metadata'!E$5,IF( B158='2. Metadata'!F$1,'2. Metadata'!F$5,IF(B158='2. Metadata'!G$1,'2. Metadata'!G$5,IF(B158='2. Metadata'!H$1,'2. Metadata'!H$5, IF(B158='2. Metadata'!I$1,'2. Metadata'!I$5, IF(B158='2. Metadata'!J$1,'2. Metadata'!J$5, IF(B158='2. Metadata'!K$1,'2. Metadata'!K$5, IF(B158='2. Metadata'!L$1,'2. Metadata'!L$5, IF(B158='2. Metadata'!M$1,'2. Metadata'!M$5, IF(B158='2. Metadata'!N$1,'2. Metadata'!N$5))))))))))))))","v":49.97944},{"$f":"IF(ISBLANK(B158)=TRUE,\" \", IF(B158='2. Metadata'!B$1,'2. Metadata'!B$6, IF(B158='2. Metadata'!C$1,'2. Metadata'!C$6,IF(B158='2. Metadata'!D$1,'2. Metadata'!D$6, IF(B158='2. Metadata'!E$1,'2. Metadata'!E$6,IF( B158='2. Metadata'!F$1,'2. Metadata'!F$6,IF(B158='2. Metadata'!G$1,'2. Metadata'!G$6,IF(B158='2. Metadata'!H$1,'2. Metadata'!H$6, IF(B158='2. Metadata'!I$1,'2. Metadata'!I$6, IF(B158='2. Metadata'!J$1,'2. Metadata'!J$6, IF(B158='2. Metadata'!K$1,'2. Metadata'!K$6, IF(B158='2. Metadata'!L$1,'2. Metadata'!L$6, IF(B158='2. Metadata'!M$1,'2. Metadata'!M$6, IF(B158='2. Metadata'!N$1,'2. Metadata'!N$6))))))))))))))","v":-117.88417},"n/a",-0.004,{"$f":"IF(ISBLANK(F158)=TRUE,\" \",'2. Metadata'!B$14)","v":"degrees Celsius"},-0.032,{"$f":"IF(ISBLANK(H158)=TRUE,\" \",'2. Metadata'!B$26)","v":"degrees Celsius"},-0.01,{"$f":"IF(ISBLANK(J158)=TRUE,\" \",'2. Metadata'!B$38)","v":"degrees Celsius"},"n/a"]
["2014-01-08","NECAR01",{"$f":"IF(ISBLANK(B159)=TRUE,\" \", IF(B159='2. Metadata'!B$1,'2. Metadata'!B$5, IF(B159='2. Metadata'!C$1,'2. Metadata'!C$5,IF(B159='2. Metadata'!D$1,'2. Metadata'!D$5, IF(B159='2. Metadata'!E$1,'2. Metadata'!E$5,IF( B159='2. Metadata'!F$1,'2. Metadata'!F$5,IF(B159='2. Metadata'!G$1,'2. Metadata'!G$5,IF(B159='2. Metadata'!H$1,'2. Metadata'!H$5, IF(B159='2. Metadata'!I$1,'2. Metadata'!I$5, IF(B159='2. Metadata'!J$1,'2. Metadata'!J$5, IF(B159='2. Metadata'!K$1,'2. Metadata'!K$5, IF(B159='2. Metadata'!L$1,'2. Metadata'!L$5, IF(B159='2. Metadata'!M$1,'2. Metadata'!M$5, IF(B159='2. Metadata'!N$1,'2. Metadata'!N$5))))))))))))))","v":49.97944},{"$f":"IF(ISBLANK(B159)=TRUE,\" \", IF(B159='2. Metadata'!B$1,'2. Metadata'!B$6, IF(B159='2. Metadata'!C$1,'2. Metadata'!C$6,IF(B159='2. Metadata'!D$1,'2. Metadata'!D$6, IF(B159='2. Metadata'!E$1,'2. Metadata'!E$6,IF( B159='2. Metadata'!F$1,'2. Metadata'!F$6,IF(B159='2. Metadata'!G$1,'2. Metadata'!G$6,IF(B159='2. Metadata'!H$1,'2. Metadata'!H$6, IF(B159='2. Metadata'!I$1,'2. Metadata'!I$6, IF(B159='2. Metadata'!J$1,'2. Metadata'!J$6, IF(B159='2. Metadata'!K$1,'2. Metadata'!K$6, IF(B159='2. Metadata'!L$1,'2. Metadata'!L$6, IF(B159='2. Metadata'!M$1,'2. Metadata'!M$6, IF(B159='2. Metadata'!N$1,'2. Metadata'!N$6))))))))))))))","v":-117.88417},"n/a",0.632,{"$f":"IF(ISBLANK(F159)=TRUE,\" \",'2. Metadata'!B$14)","v":"degrees Celsius"},-0.004,{"$f":"IF(ISBLANK(H159)=TRUE,\" \",'2. Metadata'!B$26)","v":"degrees Celsius"},0.2,{"$f":"IF(ISBLANK(J159)=TRUE,\" \",'2. Metadata'!B$38)","v":"degrees Celsius"},"n/a"]
["2014-01-09","NECAR01",{"$f":"IF(ISBLANK(B160)=TRUE,\" \", IF(B160='2. Metadata'!B$1,'2. Metadata'!B$5, IF(B160='2. Metadata'!C$1,'2. Metadata'!C$5,IF(B160='2. Metadata'!D$1,'2. Metadata'!D$5, IF(B160='2. Metadata'!E$1,'2. Metadata'!E$5,IF( B160='2. Metadata'!F$1,'2. Metadata'!F$5,IF(B160='2. Metadata'!G$1,'2. Metadata'!G$5,IF(B160='2. Metadata'!H$1,'2. Metadata'!H$5, IF(B160='2. Metadata'!I$1,'2. Metadata'!I$5, IF(B160='2. Metadata'!J$1,'2. Metadata'!J$5, IF(B160='2. Metadata'!K$1,'2. Metadata'!K$5, IF(B160='2. Metadata'!L$1,'2. Metadata'!L$5, IF(B160='2. Metadata'!M$1,'2. Metadata'!M$5, IF(B160='2. Metadata'!N$1,'2. Metadata'!N$5))))))))))))))","v":49.97944},{"$f":"IF(ISBLANK(B160)=TRUE,\" \", IF(B160='2. Metadata'!B$1,'2. Metadata'!B$6, IF(B160='2. Metadata'!C$1,'2. Metadata'!C$6,IF(B160='2. Metadata'!D$1,'2. Metadata'!D$6, IF(B160='2. Metadata'!E$1,'2. Metadata'!E$6,IF( B160='2. Metadata'!F$1,'2. Metadata'!F$6,IF(B160='2. Metadata'!G$1,'2. Metadata'!G$6,IF(B160='2. Metadata'!H$1,'2. Metadata'!H$6, IF(B160='2. Metadata'!I$1,'2. Metadata'!I$6, IF(B160='2. Metadata'!J$1,'2. Metadata'!J$6, IF(B160='2. Metadata'!K$1,'2. Metadata'!K$6, IF(B160='2. Metadata'!L$1,'2. Metadata'!L$6, IF(B160='2. Metadata'!M$1,'2. Metadata'!M$6, IF(B160='2. Metadata'!N$1,'2. Metadata'!N$6))))))))))))))","v":-117.88417},"n/a",0.989,{"$f":"IF(ISBLANK(F160)=TRUE,\" \",'2. Metadata'!B$14)","v":"degrees Celsius"},-0.004,{"$f":"IF(ISBLANK(H160)=TRUE,\" \",'2. Metadata'!B$26)","v":"degrees Celsius"},0.504,{"$f":"IF(ISBLANK(J160)=TRUE,\" \",'2. Metadata'!B$38)","v":"degrees Celsius"},"n/a"]
["2014-01-10","NECAR01",{"$f":"IF(ISBLANK(B161)=TRUE,\" \", IF(B161='2. Metadata'!B$1,'2. Metadata'!B$5, IF(B161='2. Metadata'!C$1,'2. Metadata'!C$5,IF(B161='2. Metadata'!D$1,'2. Metadata'!D$5, IF(B161='2. Metadata'!E$1,'2. Metadata'!E$5,IF( B161='2. Metadata'!F$1,'2. Metadata'!F$5,IF(B161='2. Metadata'!G$1,'2. Metadata'!G$5,IF(B161='2. Metadata'!H$1,'2. Metadata'!H$5, IF(B161='2. Metadata'!I$1,'2. Metadata'!I$5, IF(B161='2. Metadata'!J$1,'2. Metadata'!J$5, IF(B161='2. Metadata'!K$1,'2. Metadata'!K$5, IF(B161='2. Metadata'!L$1,'2. Metadata'!L$5, IF(B161='2. Metadata'!M$1,'2. Metadata'!M$5, IF(B161='2. Metadata'!N$1,'2. Metadata'!N$5))))))))))))))","v":49.97944},{"$f":"IF(ISBLANK(B161)=TRUE,\" \", IF(B161='2. Metadata'!B$1,'2. Metadata'!B$6, IF(B161='2. Metadata'!C$1,'2. Metadata'!C$6,IF(B161='2. Metadata'!D$1,'2. Metadata'!D$6, IF(B161='2. Metadata'!E$1,'2. Metadata'!E$6,IF( B161='2. Metadata'!F$1,'2. Metadata'!F$6,IF(B161='2. Metadata'!G$1,'2. Metadata'!G$6,IF(B161='2. Metadata'!H$1,'2. Metadata'!H$6, IF(B161='2. Metadata'!I$1,'2. Metadata'!I$6, IF(B161='2. Metadata'!J$1,'2. Metadata'!J$6, IF(B161='2. Metadata'!K$1,'2. Metadata'!K$6, IF(B161='2. Metadata'!L$1,'2. Metadata'!L$6, IF(B161='2. Metadata'!M$1,'2. Metadata'!M$6, IF(B161='2. Metadata'!N$1,'2. Metadata'!N$6))))))))))))))","v":-117.88417},"n/a",0.962,{"$f":"IF(ISBLANK(F161)=TRUE,\" \",'2. Metadata'!B$14)","v":"degrees Celsius"},0.135,{"$f":"IF(ISBLANK(H161)=TRUE,\" \",'2. Metadata'!B$26)","v":"degrees Celsius"},0.636,{"$f":"IF(ISBLANK(J161)=TRUE,\" \",'2. Metadata'!B$38)","v":"degrees Celsius"},"n/a"]
["2014-01-11","NECAR01",{"$f":"IF(ISBLANK(B162)=TRUE,\" \", IF(B162='2. Metadata'!B$1,'2. Metadata'!B$5, IF(B162='2. Metadata'!C$1,'2. Metadata'!C$5,IF(B162='2. Metadata'!D$1,'2. Metadata'!D$5, IF(B162='2. Metadata'!E$1,'2. Metadata'!E$5,IF( B162='2. Metadata'!F$1,'2. Metadata'!F$5,IF(B162='2. Metadata'!G$1,'2. Metadata'!G$5,IF(B162='2. Metadata'!H$1,'2. Metadata'!H$5, IF(B162='2. Metadata'!I$1,'2. Metadata'!I$5, IF(B162='2. Metadata'!J$1,'2. Metadata'!J$5, IF(B162='2. Metadata'!K$1,'2. Metadata'!K$5, IF(B162='2. Metadata'!L$1,'2. Metadata'!L$5, IF(B162='2. Metadata'!M$1,'2. Metadata'!M$5, IF(B162='2. Metadata'!N$1,'2. Metadata'!N$5))))))))))))))","v":49.97944},{"$f":"IF(ISBLANK(B162)=TRUE,\" \", IF(B162='2. Metadata'!B$1,'2. Metadata'!B$6, IF(B162='2. Metadata'!C$1,'2. Metadata'!C$6,IF(B162='2. Metadata'!D$1,'2. Metadata'!D$6, IF(B162='2. Metadata'!E$1,'2. Metadata'!E$6,IF( B162='2. Metadata'!F$1,'2. Metadata'!F$6,IF(B162='2. Metadata'!G$1,'2. Metadata'!G$6,IF(B162='2. Metadata'!H$1,'2. Metadata'!H$6, IF(B162='2. Metadata'!I$1,'2. Metadata'!I$6, IF(B162='2. Metadata'!J$1,'2. Metadata'!J$6, IF(B162='2. Metadata'!K$1,'2. Metadata'!K$6, IF(B162='2. Metadata'!L$1,'2. Metadata'!L$6, IF(B162='2. Metadata'!M$1,'2. Metadata'!M$6, IF(B162='2. Metadata'!N$1,'2. Metadata'!N$6))))))))))))))","v":-117.88417},"n/a",1.643,{"$f":"IF(ISBLANK(F162)=TRUE,\" \",'2. Metadata'!B$14)","v":"degrees Celsius"},0.852,{"$f":"IF(ISBLANK(H162)=TRUE,\" \",'2. Metadata'!B$26)","v":"degrees Celsius"},1.22,{"$f":"IF(ISBLANK(J162)=TRUE,\" \",'2. Metadata'!B$38)","v":"degrees Celsius"},"n/a"]
["2014-01-12","NECAR01",{"$f":"IF(ISBLANK(B163)=TRUE,\" \", IF(B163='2. Metadata'!B$1,'2. Metadata'!B$5, IF(B163='2. Metadata'!C$1,'2. Metadata'!C$5,IF(B163='2. Metadata'!D$1,'2. Metadata'!D$5, IF(B163='2. Metadata'!E$1,'2. Metadata'!E$5,IF( B163='2. Metadata'!F$1,'2. Metadata'!F$5,IF(B163='2. Metadata'!G$1,'2. Metadata'!G$5,IF(B163='2. Metadata'!H$1,'2. Metadata'!H$5, IF(B163='2. Metadata'!I$1,'2. Metadata'!I$5, IF(B163='2. Metadata'!J$1,'2. Metadata'!J$5, IF(B163='2. Metadata'!K$1,'2. Metadata'!K$5, IF(B163='2. Metadata'!L$1,'2. Metadata'!L$5, IF(B163='2. Metadata'!M$1,'2. Metadata'!M$5, IF(B163='2. Metadata'!N$1,'2. Metadata'!N$5))))))))))))))","v":49.97944},{"$f":"IF(ISBLANK(B163)=TRUE,\" \", IF(B163='2. Metadata'!B$1,'2. Metadata'!B$6, IF(B163='2. Metadata'!C$1,'2. Metadata'!C$6,IF(B163='2. Metadata'!D$1,'2. Metadata'!D$6, IF(B163='2. Metadata'!E$1,'2. Metadata'!E$6,IF( B163='2. Metadata'!F$1,'2. Metadata'!F$6,IF(B163='2. Metadata'!G$1,'2. Metadata'!G$6,IF(B163='2. Metadata'!H$1,'2. Metadata'!H$6, IF(B163='2. Metadata'!I$1,'2. Metadata'!I$6, IF(B163='2. Metadata'!J$1,'2. Metadata'!J$6, IF(B163='2. Metadata'!K$1,'2. Metadata'!K$6, IF(B163='2. Metadata'!L$1,'2. Metadata'!L$6, IF(B163='2. Metadata'!M$1,'2. Metadata'!M$6, IF(B163='2. Metadata'!N$1,'2. Metadata'!N$6))))))))))))))","v":-117.88417},"n/a",1.643,{"$f":"IF(ISBLANK(F163)=TRUE,\" \",'2. Metadata'!B$14)","v":"degrees Celsius"},0.632,{"$f":"IF(ISBLANK(H163)=TRUE,\" \",'2. Metadata'!B$26)","v":"degrees Celsius"},1.183,{"$f":"IF(ISBLANK(J163)=TRUE,\" \",'2. Metadata'!B$38)","v":"degrees Celsius"},"n/a"]
["2014-01-13","NECAR01",{"$f":"IF(ISBLANK(B164)=TRUE,\" \", IF(B164='2. Metadata'!B$1,'2. Metadata'!B$5, IF(B164='2. Metadata'!C$1,'2. Metadata'!C$5,IF(B164='2. Metadata'!D$1,'2. Metadata'!D$5, IF(B164='2. Metadata'!E$1,'2. Metadata'!E$5,IF( B164='2. Metadata'!F$1,'2. Metadata'!F$5,IF(B164='2. Metadata'!G$1,'2. Metadata'!G$5,IF(B164='2. Metadata'!H$1,'2. Metadata'!H$5, IF(B164='2. Metadata'!I$1,'2. Metadata'!I$5, IF(B164='2. Metadata'!J$1,'2. Metadata'!J$5, IF(B164='2. Metadata'!K$1,'2. Metadata'!K$5, IF(B164='2. Metadata'!L$1,'2. Metadata'!L$5, IF(B164='2. Metadata'!M$1,'2. Metadata'!M$5, IF(B164='2. Metadata'!N$1,'2. Metadata'!N$5))))))))))))))","v":49.97944},{"$f":"IF(ISBLANK(B164)=TRUE,\" \", IF(B164='2. Metadata'!B$1,'2. Metadata'!B$6, IF(B164='2. Metadata'!C$1,'2. Metadata'!C$6,IF(B164='2. Metadata'!D$1,'2. Metadata'!D$6, IF(B164='2. Metadata'!E$1,'2. Metadata'!E$6,IF( B164='2. Metadata'!F$1,'2. Metadata'!F$6,IF(B164='2. Metadata'!G$1,'2. Metadata'!G$6,IF(B164='2. Metadata'!H$1,'2. Metadata'!H$6, IF(B164='2. Metadata'!I$1,'2. Metadata'!I$6, IF(B164='2. Metadata'!J$1,'2. Metadata'!J$6, IF(B164='2. Metadata'!K$1,'2. Metadata'!K$6, IF(B164='2. Metadata'!L$1,'2. Metadata'!L$6, IF(B164='2. Metadata'!M$1,'2. Metadata'!M$6, IF(B164='2. Metadata'!N$1,'2. Metadata'!N$6))))))))))))))","v":-117.88417},"n/a",1.832,{"$f":"IF(ISBLANK(F164)=TRUE,\" \",'2. Metadata'!B$14)","v":"degrees Celsius"},0.962,{"$f":"IF(ISBLANK(H164)=TRUE,\" \",'2. Metadata'!B$26)","v":"degrees Celsius"},1.28,{"$f":"IF(ISBLANK(J164)=TRUE,\" \",'2. Metadata'!B$38)","v":"degrees Celsius"},"n/a"]
["2014-01-14","NECAR01",{"$f":"IF(ISBLANK(B165)=TRUE,\" \", IF(B165='2. Metadata'!B$1,'2. Metadata'!B$5, IF(B165='2. Metadata'!C$1,'2. Metadata'!C$5,IF(B165='2. Metadata'!D$1,'2. Metadata'!D$5, IF(B165='2. Metadata'!E$1,'2. Metadata'!E$5,IF( B165='2. Metadata'!F$1,'2. Metadata'!F$5,IF(B165='2. Metadata'!G$1,'2. Metadata'!G$5,IF(B165='2. Metadata'!H$1,'2. Metadata'!H$5, IF(B165='2. Metadata'!I$1,'2. Metadata'!I$5, IF(B165='2. Metadata'!J$1,'2. Metadata'!J$5, IF(B165='2. Metadata'!K$1,'2. Metadata'!K$5, IF(B165='2. Metadata'!L$1,'2. Metadata'!L$5, IF(B165='2. Metadata'!M$1,'2. Metadata'!M$5, IF(B165='2. Metadata'!N$1,'2. Metadata'!N$5))))))))))))))","v":49.97944},{"$f":"IF(ISBLANK(B165)=TRUE,\" \", IF(B165='2. Metadata'!B$1,'2. Metadata'!B$6, IF(B165='2. Metadata'!C$1,'2. Metadata'!C$6,IF(B165='2. Metadata'!D$1,'2. Metadata'!D$6, IF(B165='2. Metadata'!E$1,'2. Metadata'!E$6,IF( B165='2. Metadata'!F$1,'2. Metadata'!F$6,IF(B165='2. Metadata'!G$1,'2. Metadata'!G$6,IF(B165='2. Metadata'!H$1,'2. Metadata'!H$6, IF(B165='2. Metadata'!I$1,'2. Metadata'!I$6, IF(B165='2. Metadata'!J$1,'2. Metadata'!J$6, IF(B165='2. Metadata'!K$1,'2. Metadata'!K$6, IF(B165='2. Metadata'!L$1,'2. Metadata'!L$6, IF(B165='2. Metadata'!M$1,'2. Metadata'!M$6, IF(B165='2. Metadata'!N$1,'2. Metadata'!N$6))))))))))))))","v":-117.88417},"n/a",2.074,{"$f":"IF(ISBLANK(F165)=TRUE,\" \",'2. Metadata'!B$14)","v":"degrees Celsius"},0.962,{"$f":"IF(ISBLANK(H165)=TRUE,\" \",'2. Metadata'!B$26)","v":"degrees Celsius"},1.488,{"$f":"IF(ISBLANK(J165)=TRUE,\" \",'2. Metadata'!B$38)","v":"degrees Celsius"},"n/a"]
["2014-01-15","NECAR01",{"$f":"IF(ISBLANK(B166)=TRUE,\" \", IF(B166='2. Metadata'!B$1,'2. Metadata'!B$5, IF(B166='2. Metadata'!C$1,'2. Metadata'!C$5,IF(B166='2. Metadata'!D$1,'2. Metadata'!D$5, IF(B166='2. Metadata'!E$1,'2. Metadata'!E$5,IF( B166='2. Metadata'!F$1,'2. Metadata'!F$5,IF(B166='2. Metadata'!G$1,'2. Metadata'!G$5,IF(B166='2. Metadata'!H$1,'2. Metadata'!H$5, IF(B166='2. Metadata'!I$1,'2. Metadata'!I$5, IF(B166='2. Metadata'!J$1,'2. Metadata'!J$5, IF(B166='2. Metadata'!K$1,'2. Metadata'!K$5, IF(B166='2. Metadata'!L$1,'2. Metadata'!L$5, IF(B166='2. Metadata'!M$1,'2. Metadata'!M$5, IF(B166='2. Metadata'!N$1,'2. Metadata'!N$5))))))))))))))","v":49.97944},{"$f":"IF(ISBLANK(B166)=TRUE,\" \", IF(B166='2. Metadata'!B$1,'2. Metadata'!B$6, IF(B166='2. Metadata'!C$1,'2. Metadata'!C$6,IF(B166='2. Metadata'!D$1,'2. Metadata'!D$6, IF(B166='2. Metadata'!E$1,'2. Metadata'!E$6,IF( B166='2. Metadata'!F$1,'2. Metadata'!F$6,IF(B166='2. Metadata'!G$1,'2. Metadata'!G$6,IF(B166='2. Metadata'!H$1,'2. Metadata'!H$6, IF(B166='2. Metadata'!I$1,'2. Metadata'!I$6, IF(B166='2. Metadata'!J$1,'2. Metadata'!J$6, IF(B166='2. Metadata'!K$1,'2. Metadata'!K$6, IF(B166='2. Metadata'!L$1,'2. Metadata'!L$6, IF(B166='2. Metadata'!M$1,'2. Metadata'!M$6, IF(B166='2. Metadata'!N$1,'2. Metadata'!N$6))))))))))))))","v":-117.88417},"n/a",2.101,{"$f":"IF(ISBLANK(F166)=TRUE,\" \",'2. Metadata'!B$14)","v":"degrees Celsius"},1.289,{"$f":"IF(ISBLANK(H166)=TRUE,\" \",'2. Metadata'!B$26)","v":"degrees Celsius"},1.582,{"$f":"IF(ISBLANK(J166)=TRUE,\" \",'2. Metadata'!B$38)","v":"degrees Celsius"},"n/a"]
["2014-01-16","NECAR01",{"$f":"IF(ISBLANK(B167)=TRUE,\" \", IF(B167='2. Metadata'!B$1,'2. Metadata'!B$5, IF(B167='2. Metadata'!C$1,'2. Metadata'!C$5,IF(B167='2. Metadata'!D$1,'2. Metadata'!D$5, IF(B167='2. Metadata'!E$1,'2. Metadata'!E$5,IF( B167='2. Metadata'!F$1,'2. Metadata'!F$5,IF(B167='2. Metadata'!G$1,'2. Metadata'!G$5,IF(B167='2. Metadata'!H$1,'2. Metadata'!H$5, IF(B167='2. Metadata'!I$1,'2. Metadata'!I$5, IF(B167='2. Metadata'!J$1,'2. Metadata'!J$5, IF(B167='2. Metadata'!K$1,'2. Metadata'!K$5, IF(B167='2. Metadata'!L$1,'2. Metadata'!L$5, IF(B167='2. Metadata'!M$1,'2. Metadata'!M$5, IF(B167='2. Metadata'!N$1,'2. Metadata'!N$5))))))))))))))","v":49.97944},{"$f":"IF(ISBLANK(B167)=TRUE,\" \", IF(B167='2. Metadata'!B$1,'2. Metadata'!B$6, IF(B167='2. Metadata'!C$1,'2. Metadata'!C$6,IF(B167='2. Metadata'!D$1,'2. Metadata'!D$6, IF(B167='2. Metadata'!E$1,'2. Metadata'!E$6,IF( B167='2. Metadata'!F$1,'2. Metadata'!F$6,IF(B167='2. Metadata'!G$1,'2. Metadata'!G$6,IF(B167='2. Metadata'!H$1,'2. Metadata'!H$6, IF(B167='2. Metadata'!I$1,'2. Metadata'!I$6, IF(B167='2. Metadata'!J$1,'2. Metadata'!J$6, IF(B167='2. Metadata'!K$1,'2. Metadata'!K$6, IF(B167='2. Metadata'!L$1,'2. Metadata'!L$6, IF(B167='2. Metadata'!M$1,'2. Metadata'!M$6, IF(B167='2. Metadata'!N$1,'2. Metadata'!N$6))))))))))))))","v":-117.88417},"n/a",1.967,{"$f":"IF(ISBLANK(F167)=TRUE,\" \",'2. Metadata'!B$14)","v":"degrees Celsius"},1.289,{"$f":"IF(ISBLANK(H167)=TRUE,\" \",'2. Metadata'!B$26)","v":"degrees Celsius"},1.609,{"$f":"IF(ISBLANK(J167)=TRUE,\" \",'2. Metadata'!B$38)","v":"degrees Celsius"},"n/a"]
["2014-01-17","NECAR01",{"$f":"IF(ISBLANK(B168)=TRUE,\" \", IF(B168='2. Metadata'!B$1,'2. Metadata'!B$5, IF(B168='2. Metadata'!C$1,'2. Metadata'!C$5,IF(B168='2. Metadata'!D$1,'2. Metadata'!D$5, IF(B168='2. Metadata'!E$1,'2. Metadata'!E$5,IF( B168='2. Metadata'!F$1,'2. Metadata'!F$5,IF(B168='2. Metadata'!G$1,'2. Metadata'!G$5,IF(B168='2. Metadata'!H$1,'2. Metadata'!H$5, IF(B168='2. Metadata'!I$1,'2. Metadata'!I$5, IF(B168='2. Metadata'!J$1,'2. Metadata'!J$5, IF(B168='2. Metadata'!K$1,'2. Metadata'!K$5, IF(B168='2. Metadata'!L$1,'2. Metadata'!L$5, IF(B168='2. Metadata'!M$1,'2. Metadata'!M$5, IF(B168='2. Metadata'!N$1,'2. Metadata'!N$5))))))))))))))","v":49.97944},{"$f":"IF(ISBLANK(B168)=TRUE,\" \", IF(B168='2. Metadata'!B$1,'2. Metadata'!B$6, IF(B168='2. Metadata'!C$1,'2. Metadata'!C$6,IF(B168='2. Metadata'!D$1,'2. Metadata'!D$6, IF(B168='2. Metadata'!E$1,'2. Metadata'!E$6,IF( B168='2. Metadata'!F$1,'2. Metadata'!F$6,IF(B168='2. Metadata'!G$1,'2. Metadata'!G$6,IF(B168='2. Metadata'!H$1,'2. Metadata'!H$6, IF(B168='2. Metadata'!I$1,'2. Metadata'!I$6, IF(B168='2. Metadata'!J$1,'2. Metadata'!J$6, IF(B168='2. Metadata'!K$1,'2. Metadata'!K$6, IF(B168='2. Metadata'!L$1,'2. Metadata'!L$6, IF(B168='2. Metadata'!M$1,'2. Metadata'!M$6, IF(B168='2. Metadata'!N$1,'2. Metadata'!N$6))))))))))))))","v":-117.88417},"n/a",1.615,{"$f":"IF(ISBLANK(F168)=TRUE,\" \",'2. Metadata'!B$14)","v":"degrees Celsius"},1.044,{"$f":"IF(ISBLANK(H168)=TRUE,\" \",'2. Metadata'!B$26)","v":"degrees Celsius"},1.298,{"$f":"IF(ISBLANK(J168)=TRUE,\" \",'2. Metadata'!B$38)","v":"degrees Celsius"},"n/a"]
["2014-01-18","NECAR01",{"$f":"IF(ISBLANK(B169)=TRUE,\" \", IF(B169='2. Metadata'!B$1,'2. Metadata'!B$5, IF(B169='2. Metadata'!C$1,'2. Metadata'!C$5,IF(B169='2. Metadata'!D$1,'2. Metadata'!D$5, IF(B169='2. Metadata'!E$1,'2. Metadata'!E$5,IF( B169='2. Metadata'!F$1,'2. Metadata'!F$5,IF(B169='2. Metadata'!G$1,'2. Metadata'!G$5,IF(B169='2. Metadata'!H$1,'2. Metadata'!H$5, IF(B169='2. Metadata'!I$1,'2. Metadata'!I$5, IF(B169='2. Metadata'!J$1,'2. Metadata'!J$5, IF(B169='2. Metadata'!K$1,'2. Metadata'!K$5, IF(B169='2. Metadata'!L$1,'2. Metadata'!L$5, IF(B169='2. Metadata'!M$1,'2. Metadata'!M$5, IF(B169='2. Metadata'!N$1,'2. Metadata'!N$5))))))))))))))","v":49.97944},{"$f":"IF(ISBLANK(B169)=TRUE,\" \", IF(B169='2. Metadata'!B$1,'2. Metadata'!B$6, IF(B169='2. Metadata'!C$1,'2. Metadata'!C$6,IF(B169='2. Metadata'!D$1,'2. Metadata'!D$6, IF(B169='2. Metadata'!E$1,'2. Metadata'!E$6,IF( B169='2. Metadata'!F$1,'2. Metadata'!F$6,IF(B169='2. Metadata'!G$1,'2. Metadata'!G$6,IF(B169='2. Metadata'!H$1,'2. Metadata'!H$6, IF(B169='2. Metadata'!I$1,'2. Metadata'!I$6, IF(B169='2. Metadata'!J$1,'2. Metadata'!J$6, IF(B169='2. Metadata'!K$1,'2. Metadata'!K$6, IF(B169='2. Metadata'!L$1,'2. Metadata'!L$6, IF(B169='2. Metadata'!M$1,'2. Metadata'!M$6, IF(B169='2. Metadata'!N$1,'2. Metadata'!N$6))))))))))))))","v":-117.88417},"n/a",1.235,{"$f":"IF(ISBLANK(F169)=TRUE,\" \",'2. Metadata'!B$14)","v":"degrees Celsius"},0.77,{"$f":"IF(ISBLANK(H169)=TRUE,\" \",'2. Metadata'!B$26)","v":"degrees Celsius"},0.947,{"$f":"IF(ISBLANK(J169)=TRUE,\" \",'2. Metadata'!B$38)","v":"degrees Celsius"},"n/a"]
["2014-01-19","NECAR01",{"$f":"IF(ISBLANK(B170)=TRUE,\" \", IF(B170='2. Metadata'!B$1,'2. Metadata'!B$5, IF(B170='2. Metadata'!C$1,'2. Metadata'!C$5,IF(B170='2. Metadata'!D$1,'2. Metadata'!D$5, IF(B170='2. Metadata'!E$1,'2. Metadata'!E$5,IF( B170='2. Metadata'!F$1,'2. Metadata'!F$5,IF(B170='2. Metadata'!G$1,'2. Metadata'!G$5,IF(B170='2. Metadata'!H$1,'2. Metadata'!H$5, IF(B170='2. Metadata'!I$1,'2. Metadata'!I$5, IF(B170='2. Metadata'!J$1,'2. Metadata'!J$5, IF(B170='2. Metadata'!K$1,'2. Metadata'!K$5, IF(B170='2. Metadata'!L$1,'2. Metadata'!L$5, IF(B170='2. Metadata'!M$1,'2. Metadata'!M$5, IF(B170='2. Metadata'!N$1,'2. Metadata'!N$5))))))))))))))","v":49.97944},{"$f":"IF(ISBLANK(B170)=TRUE,\" \", IF(B170='2. Metadata'!B$1,'2. Metadata'!B$6, IF(B170='2. Metadata'!C$1,'2. Metadata'!C$6,IF(B170='2. Metadata'!D$1,'2. Metadata'!D$6, IF(B170='2. Metadata'!E$1,'2. Metadata'!E$6,IF( B170='2. Metadata'!F$1,'2. Metadata'!F$6,IF(B170='2. Metadata'!G$1,'2. Metadata'!G$6,IF(B170='2. Metadata'!H$1,'2. Metadata'!H$6, IF(B170='2. Metadata'!I$1,'2. Metadata'!I$6, IF(B170='2. Metadata'!J$1,'2. Metadata'!J$6, IF(B170='2. Metadata'!K$1,'2. Metadata'!K$6, IF(B170='2. Metadata'!L$1,'2. Metadata'!L$6, IF(B170='2. Metadata'!M$1,'2. Metadata'!M$6, IF(B170='2. Metadata'!N$1,'2. Metadata'!N$6))))))))))))))","v":-117.88417},"n/a",1.344,{"$f":"IF(ISBLANK(F170)=TRUE,\" \",'2. Metadata'!B$14)","v":"degrees Celsius"},0.742,{"$f":"IF(ISBLANK(H170)=TRUE,\" \",'2. Metadata'!B$26)","v":"degrees Celsius"},0.991,{"$f":"IF(ISBLANK(J170)=TRUE,\" \",'2. Metadata'!B$38)","v":"degrees Celsius"},"n/a"]
["2014-01-20","NECAR01",{"$f":"IF(ISBLANK(B171)=TRUE,\" \", IF(B171='2. Metadata'!B$1,'2. Metadata'!B$5, IF(B171='2. Metadata'!C$1,'2. Metadata'!C$5,IF(B171='2. Metadata'!D$1,'2. Metadata'!D$5, IF(B171='2. Metadata'!E$1,'2. Metadata'!E$5,IF( B171='2. Metadata'!F$1,'2. Metadata'!F$5,IF(B171='2. Metadata'!G$1,'2. Metadata'!G$5,IF(B171='2. Metadata'!H$1,'2. Metadata'!H$5, IF(B171='2. Metadata'!I$1,'2. Metadata'!I$5, IF(B171='2. Metadata'!J$1,'2. Metadata'!J$5, IF(B171='2. Metadata'!K$1,'2. Metadata'!K$5, IF(B171='2. Metadata'!L$1,'2. Metadata'!L$5, IF(B171='2. Metadata'!M$1,'2. Metadata'!M$5, IF(B171='2. Metadata'!N$1,'2. Metadata'!N$5))))))))))))))","v":49.97944},{"$f":"IF(ISBLANK(B171)=TRUE,\" \", IF(B171='2. Metadata'!B$1,'2. Metadata'!B$6, IF(B171='2. Metadata'!C$1,'2. Metadata'!C$6,IF(B171='2. Metadata'!D$1,'2. Metadata'!D$6, IF(B171='2. Metadata'!E$1,'2. Metadata'!E$6,IF( B171='2. Metadata'!F$1,'2. Metadata'!F$6,IF(B171='2. Metadata'!G$1,'2. Metadata'!G$6,IF(B171='2. Metadata'!H$1,'2. Metadata'!H$6, IF(B171='2. Metadata'!I$1,'2. Metadata'!I$6, IF(B171='2. Metadata'!J$1,'2. Metadata'!J$6, IF(B171='2. Metadata'!K$1,'2. Metadata'!K$6, IF(B171='2. Metadata'!L$1,'2. Metadata'!L$6, IF(B171='2. Metadata'!M$1,'2. Metadata'!M$6, IF(B171='2. Metadata'!N$1,'2. Metadata'!N$6))))))))))))))","v":-117.88417},"n/a",1.18,{"$f":"IF(ISBLANK(F171)=TRUE,\" \",'2. Metadata'!B$14)","v":"degrees Celsius"},0.632,{"$f":"IF(ISBLANK(H171)=TRUE,\" \",'2. Metadata'!B$26)","v":"degrees Celsius"},0.854,{"$f":"IF(ISBLANK(J171)=TRUE,\" \",'2. Metadata'!B$38)","v":"degrees Celsius"},"n/a"]
["2014-01-21","NECAR01",{"$f":"IF(ISBLANK(B172)=TRUE,\" \", IF(B172='2. Metadata'!B$1,'2. Metadata'!B$5, IF(B172='2. Metadata'!C$1,'2. Metadata'!C$5,IF(B172='2. Metadata'!D$1,'2. Metadata'!D$5, IF(B172='2. Metadata'!E$1,'2. Metadata'!E$5,IF( B172='2. Metadata'!F$1,'2. Metadata'!F$5,IF(B172='2. Metadata'!G$1,'2. Metadata'!G$5,IF(B172='2. Metadata'!H$1,'2. Metadata'!H$5, IF(B172='2. Metadata'!I$1,'2. Metadata'!I$5, IF(B172='2. Metadata'!J$1,'2. Metadata'!J$5, IF(B172='2. Metadata'!K$1,'2. Metadata'!K$5, IF(B172='2. Metadata'!L$1,'2. Metadata'!L$5, IF(B172='2. Metadata'!M$1,'2. Metadata'!M$5, IF(B172='2. Metadata'!N$1,'2. Metadata'!N$5))))))))))))))","v":49.97944},{"$f":"IF(ISBLANK(B172)=TRUE,\" \", IF(B172='2. Metadata'!B$1,'2. Metadata'!B$6, IF(B172='2. Metadata'!C$1,'2. Metadata'!C$6,IF(B172='2. Metadata'!D$1,'2. Metadata'!D$6, IF(B172='2. Metadata'!E$1,'2. Metadata'!E$6,IF( B172='2. Metadata'!F$1,'2. Metadata'!F$6,IF(B172='2. Metadata'!G$1,'2. Metadata'!G$6,IF(B172='2. Metadata'!H$1,'2. Metadata'!H$6, IF(B172='2. Metadata'!I$1,'2. Metadata'!I$6, IF(B172='2. Metadata'!J$1,'2. Metadata'!J$6, IF(B172='2. Metadata'!K$1,'2. Metadata'!K$6, IF(B172='2. Metadata'!L$1,'2. Metadata'!L$6, IF(B172='2. Metadata'!M$1,'2. Metadata'!M$6, IF(B172='2. Metadata'!N$1,'2. Metadata'!N$6))))))))))))))","v":-117.88417},"n/a",0.962,{"$f":"IF(ISBLANK(F172)=TRUE,\" \",'2. Metadata'!B$14)","v":"degrees Celsius"},0.329,{"$f":"IF(ISBLANK(H172)=TRUE,\" \",'2. Metadata'!B$26)","v":"degrees Celsius"},0.542,{"$f":"IF(ISBLANK(J172)=TRUE,\" \",'2. Metadata'!B$38)","v":"degrees Celsius"},"n/a"]
["2014-01-22","NECAR01",{"$f":"IF(ISBLANK(B173)=TRUE,\" \", IF(B173='2. Metadata'!B$1,'2. Metadata'!B$5, IF(B173='2. Metadata'!C$1,'2. Metadata'!C$5,IF(B173='2. Metadata'!D$1,'2. Metadata'!D$5, IF(B173='2. Metadata'!E$1,'2. Metadata'!E$5,IF( B173='2. Metadata'!F$1,'2. Metadata'!F$5,IF(B173='2. Metadata'!G$1,'2. Metadata'!G$5,IF(B173='2. Metadata'!H$1,'2. Metadata'!H$5, IF(B173='2. Metadata'!I$1,'2. Metadata'!I$5, IF(B173='2. Metadata'!J$1,'2. Metadata'!J$5, IF(B173='2. Metadata'!K$1,'2. Metadata'!K$5, IF(B173='2. Metadata'!L$1,'2. Metadata'!L$5, IF(B173='2. Metadata'!M$1,'2. Metadata'!M$5, IF(B173='2. Metadata'!N$1,'2. Metadata'!N$5))))))))))))))","v":49.97944},{"$f":"IF(ISBLANK(B173)=TRUE,\" \", IF(B173='2. Metadata'!B$1,'2. Metadata'!B$6, IF(B173='2. Metadata'!C$1,'2. Metadata'!C$6,IF(B173='2. Metadata'!D$1,'2. Metadata'!D$6, IF(B173='2. Metadata'!E$1,'2. Metadata'!E$6,IF( B173='2. Metadata'!F$1,'2. Metadata'!F$6,IF(B173='2. Metadata'!G$1,'2. Metadata'!G$6,IF(B173='2. Metadata'!H$1,'2. Metadata'!H$6, IF(B173='2. Metadata'!I$1,'2. Metadata'!I$6, IF(B173='2. Metadata'!J$1,'2. Metadata'!J$6, IF(B173='2. Metadata'!K$1,'2. Metadata'!K$6, IF(B173='2. Metadata'!L$1,'2. Metadata'!L$6, IF(B173='2. Metadata'!M$1,'2. Metadata'!M$6, IF(B173='2. Metadata'!N$1,'2. Metadata'!N$6))))))))))))))","v":-117.88417},"n/a",1.48,{"$f":"IF(ISBLANK(F173)=TRUE,\" \",'2. Metadata'!B$14)","v":"degrees Celsius"},0.356,{"$f":"IF(ISBLANK(H173)=TRUE,\" \",'2. Metadata'!B$26)","v":"degrees Celsius"},0.695,{"$f":"IF(ISBLANK(J173)=TRUE,\" \",'2. Metadata'!B$38)","v":"degrees Celsius"},"n/a"]
["2014-01-23","NECAR01",{"$f":"IF(ISBLANK(B174)=TRUE,\" \", IF(B174='2. Metadata'!B$1,'2. Metadata'!B$5, IF(B174='2. Metadata'!C$1,'2. Metadata'!C$5,IF(B174='2. Metadata'!D$1,'2. Metadata'!D$5, IF(B174='2. Metadata'!E$1,'2. Metadata'!E$5,IF( B174='2. Metadata'!F$1,'2. Metadata'!F$5,IF(B174='2. Metadata'!G$1,'2. Metadata'!G$5,IF(B174='2. Metadata'!H$1,'2. Metadata'!H$5, IF(B174='2. Metadata'!I$1,'2. Metadata'!I$5, IF(B174='2. Metadata'!J$1,'2. Metadata'!J$5, IF(B174='2. Metadata'!K$1,'2. Metadata'!K$5, IF(B174='2. Metadata'!L$1,'2. Metadata'!L$5, IF(B174='2. Metadata'!M$1,'2. Metadata'!M$5, IF(B174='2. Metadata'!N$1,'2. Metadata'!N$5))))))))))))))","v":49.97944},{"$f":"IF(ISBLANK(B174)=TRUE,\" \", IF(B174='2. Metadata'!B$1,'2. Metadata'!B$6, IF(B174='2. Metadata'!C$1,'2. Metadata'!C$6,IF(B174='2. Metadata'!D$1,'2. Metadata'!D$6, IF(B174='2. Metadata'!E$1,'2. Metadata'!E$6,IF( B174='2. Metadata'!F$1,'2. Metadata'!F$6,IF(B174='2. Metadata'!G$1,'2. Metadata'!G$6,IF(B174='2. Metadata'!H$1,'2. Metadata'!H$6, IF(B174='2. Metadata'!I$1,'2. Metadata'!I$6, IF(B174='2. Metadata'!J$1,'2. Metadata'!J$6, IF(B174='2. Metadata'!K$1,'2. Metadata'!K$6, IF(B174='2. Metadata'!L$1,'2. Metadata'!L$6, IF(B174='2. Metadata'!M$1,'2. Metadata'!M$6, IF(B174='2. Metadata'!N$1,'2. Metadata'!N$6))))))))))))))","v":-117.88417},"n/a",1.832,{"$f":"IF(ISBLANK(F174)=TRUE,\" \",'2. Metadata'!B$14)","v":"degrees Celsius"},0.412,{"$f":"IF(ISBLANK(H174)=TRUE,\" \",'2. Metadata'!B$26)","v":"degrees Celsius"},1.082,{"$f":"IF(ISBLANK(J174)=TRUE,\" \",'2. Metadata'!B$38)","v":"degrees Celsius"},"n/a"]
["2014-01-24","NECAR01",{"$f":"IF(ISBLANK(B175)=TRUE,\" \", IF(B175='2. Metadata'!B$1,'2. Metadata'!B$5, IF(B175='2. Metadata'!C$1,'2. Metadata'!C$5,IF(B175='2. Metadata'!D$1,'2. Metadata'!D$5, IF(B175='2. Metadata'!E$1,'2. Metadata'!E$5,IF( B175='2. Metadata'!F$1,'2. Metadata'!F$5,IF(B175='2. Metadata'!G$1,'2. Metadata'!G$5,IF(B175='2. Metadata'!H$1,'2. Metadata'!H$5, IF(B175='2. Metadata'!I$1,'2. Metadata'!I$5, IF(B175='2. Metadata'!J$1,'2. Metadata'!J$5, IF(B175='2. Metadata'!K$1,'2. Metadata'!K$5, IF(B175='2. Metadata'!L$1,'2. Metadata'!L$5, IF(B175='2. Metadata'!M$1,'2. Metadata'!M$5, IF(B175='2. Metadata'!N$1,'2. Metadata'!N$5))))))))))))))","v":49.97944},{"$f":"IF(ISBLANK(B175)=TRUE,\" \", IF(B175='2. Metadata'!B$1,'2. Metadata'!B$6, IF(B175='2. Metadata'!C$1,'2. Metadata'!C$6,IF(B175='2. Metadata'!D$1,'2. Metadata'!D$6, IF(B175='2. Metadata'!E$1,'2. Metadata'!E$6,IF( B175='2. Metadata'!F$1,'2. Metadata'!F$6,IF(B175='2. Metadata'!G$1,'2. Metadata'!G$6,IF(B175='2. Metadata'!H$1,'2. Metadata'!H$6, IF(B175='2. Metadata'!I$1,'2. Metadata'!I$6, IF(B175='2. Metadata'!J$1,'2. Metadata'!J$6, IF(B175='2. Metadata'!K$1,'2. Metadata'!K$6, IF(B175='2. Metadata'!L$1,'2. Metadata'!L$6, IF(B175='2. Metadata'!M$1,'2. Metadata'!M$6, IF(B175='2. Metadata'!N$1,'2. Metadata'!N$6))))))))))))))","v":-117.88417},"n/a",1.615,{"$f":"IF(ISBLANK(F175)=TRUE,\" \",'2. Metadata'!B$14)","v":"degrees Celsius"},0.989,{"$f":"IF(ISBLANK(H175)=TRUE,\" \",'2. Metadata'!B$26)","v":"degrees Celsius"},1.271,{"$f":"IF(ISBLANK(J175)=TRUE,\" \",'2. Metadata'!B$38)","v":"degrees Celsius"},"n/a"]
["2014-01-25","NECAR01",{"$f":"IF(ISBLANK(B176)=TRUE,\" \", IF(B176='2. Metadata'!B$1,'2. Metadata'!B$5, IF(B176='2. Metadata'!C$1,'2. Metadata'!C$5,IF(B176='2. Metadata'!D$1,'2. Metadata'!D$5, IF(B176='2. Metadata'!E$1,'2. Metadata'!E$5,IF( B176='2. Metadata'!F$1,'2. Metadata'!F$5,IF(B176='2. Metadata'!G$1,'2. Metadata'!G$5,IF(B176='2. Metadata'!H$1,'2. Metadata'!H$5, IF(B176='2. Metadata'!I$1,'2. Metadata'!I$5, IF(B176='2. Metadata'!J$1,'2. Metadata'!J$5, IF(B176='2. Metadata'!K$1,'2. Metadata'!K$5, IF(B176='2. Metadata'!L$1,'2. Metadata'!L$5, IF(B176='2. Metadata'!M$1,'2. Metadata'!M$5, IF(B176='2. Metadata'!N$1,'2. Metadata'!N$5))))))))))))))","v":49.97944},{"$f":"IF(ISBLANK(B176)=TRUE,\" \", IF(B176='2. Metadata'!B$1,'2. Metadata'!B$6, IF(B176='2. Metadata'!C$1,'2. Metadata'!C$6,IF(B176='2. Metadata'!D$1,'2. Metadata'!D$6, IF(B176='2. Metadata'!E$1,'2. Metadata'!E$6,IF( B176='2. Metadata'!F$1,'2. Metadata'!F$6,IF(B176='2. Metadata'!G$1,'2. Metadata'!G$6,IF(B176='2. Metadata'!H$1,'2. Metadata'!H$6, IF(B176='2. Metadata'!I$1,'2. Metadata'!I$6, IF(B176='2. Metadata'!J$1,'2. Metadata'!J$6, IF(B176='2. Metadata'!K$1,'2. Metadata'!K$6, IF(B176='2. Metadata'!L$1,'2. Metadata'!L$6, IF(B176='2. Metadata'!M$1,'2. Metadata'!M$6, IF(B176='2. Metadata'!N$1,'2. Metadata'!N$6))))))))))))))","v":-117.88417},"n/a",2.209,{"$f":"IF(ISBLANK(F176)=TRUE,\" \",'2. Metadata'!B$14)","v":"degrees Celsius"},1.344,{"$f":"IF(ISBLANK(H176)=TRUE,\" \",'2. Metadata'!B$26)","v":"degrees Celsius"},1.608,{"$f":"IF(ISBLANK(J176)=TRUE,\" \",'2. Metadata'!B$38)","v":"degrees Celsius"},"n/a"]
["2014-01-26","NECAR01",{"$f":"IF(ISBLANK(B177)=TRUE,\" \", IF(B177='2. Metadata'!B$1,'2. Metadata'!B$5, IF(B177='2. Metadata'!C$1,'2. Metadata'!C$5,IF(B177='2. Metadata'!D$1,'2. Metadata'!D$5, IF(B177='2. Metadata'!E$1,'2. Metadata'!E$5,IF( B177='2. Metadata'!F$1,'2. Metadata'!F$5,IF(B177='2. Metadata'!G$1,'2. Metadata'!G$5,IF(B177='2. Metadata'!H$1,'2. Metadata'!H$5, IF(B177='2. Metadata'!I$1,'2. Metadata'!I$5, IF(B177='2. Metadata'!J$1,'2. Metadata'!J$5, IF(B177='2. Metadata'!K$1,'2. Metadata'!K$5, IF(B177='2. Metadata'!L$1,'2. Metadata'!L$5, IF(B177='2. Metadata'!M$1,'2. Metadata'!M$5, IF(B177='2. Metadata'!N$1,'2. Metadata'!N$5))))))))))))))","v":49.97944},{"$f":"IF(ISBLANK(B177)=TRUE,\" \", IF(B177='2. Metadata'!B$1,'2. Metadata'!B$6, IF(B177='2. Metadata'!C$1,'2. Metadata'!C$6,IF(B177='2. Metadata'!D$1,'2. Metadata'!D$6, IF(B177='2. Metadata'!E$1,'2. Metadata'!E$6,IF( B177='2. Metadata'!F$1,'2. Metadata'!F$6,IF(B177='2. Metadata'!G$1,'2. Metadata'!G$6,IF(B177='2. Metadata'!H$1,'2. Metadata'!H$6, IF(B177='2. Metadata'!I$1,'2. Metadata'!I$6, IF(B177='2. Metadata'!J$1,'2. Metadata'!J$6, IF(B177='2. Metadata'!K$1,'2. Metadata'!K$6, IF(B177='2. Metadata'!L$1,'2. Metadata'!L$6, IF(B177='2. Metadata'!M$1,'2. Metadata'!M$6, IF(B177='2. Metadata'!N$1,'2. Metadata'!N$6))))))))))))))","v":-117.88417},"n/a",2.262,{"$f":"IF(ISBLANK(F177)=TRUE,\" \",'2. Metadata'!B$14)","v":"degrees Celsius"},1.398,{"$f":"IF(ISBLANK(H177)=TRUE,\" \",'2. Metadata'!B$26)","v":"degrees Celsius"},1.704,{"$f":"IF(ISBLANK(J177)=TRUE,\" \",'2. Metadata'!B$38)","v":"degrees Celsius"},"n/a"]
["2014-01-27","NECAR01",{"$f":"IF(ISBLANK(B178)=TRUE,\" \", IF(B178='2. Metadata'!B$1,'2. Metadata'!B$5, IF(B178='2. Metadata'!C$1,'2. Metadata'!C$5,IF(B178='2. Metadata'!D$1,'2. Metadata'!D$5, IF(B178='2. Metadata'!E$1,'2. Metadata'!E$5,IF( B178='2. Metadata'!F$1,'2. Metadata'!F$5,IF(B178='2. Metadata'!G$1,'2. Metadata'!G$5,IF(B178='2. Metadata'!H$1,'2. Metadata'!H$5, IF(B178='2. Metadata'!I$1,'2. Metadata'!I$5, IF(B178='2. Metadata'!J$1,'2. Metadata'!J$5, IF(B178='2. Metadata'!K$1,'2. Metadata'!K$5, IF(B178='2. Metadata'!L$1,'2. Metadata'!L$5, IF(B178='2. Metadata'!M$1,'2. Metadata'!M$5, IF(B178='2. Metadata'!N$1,'2. Metadata'!N$5))))))))))))))","v":49.97944},{"$f":"IF(ISBLANK(B178)=TRUE,\" \", IF(B178='2. Metadata'!B$1,'2. Metadata'!B$6, IF(B178='2. Metadata'!C$1,'2. Metadata'!C$6,IF(B178='2. Metadata'!D$1,'2. Metadata'!D$6, IF(B178='2. Metadata'!E$1,'2. Metadata'!E$6,IF( B178='2. Metadata'!F$1,'2. Metadata'!F$6,IF(B178='2. Metadata'!G$1,'2. Metadata'!G$6,IF(B178='2. Metadata'!H$1,'2. Metadata'!H$6, IF(B178='2. Metadata'!I$1,'2. Metadata'!I$6, IF(B178='2. Metadata'!J$1,'2. Metadata'!J$6, IF(B178='2. Metadata'!K$1,'2. Metadata'!K$6, IF(B178='2. Metadata'!L$1,'2. Metadata'!L$6, IF(B178='2. Metadata'!M$1,'2. Metadata'!M$6, IF(B178='2. Metadata'!N$1,'2. Metadata'!N$6))))))))))))))","v":-117.88417},"n/a",2.155,{"$f":"IF(ISBLANK(F178)=TRUE,\" \",'2. Metadata'!B$14)","v":"degrees Celsius"},1.588,{"$f":"IF(ISBLANK(H178)=TRUE,\" \",'2. Metadata'!B$26)","v":"degrees Celsius"},1.776,{"$f":"IF(ISBLANK(J178)=TRUE,\" \",'2. Metadata'!B$38)","v":"degrees Celsius"},"n/a"]
["2014-01-28","NECAR01",{"$f":"IF(ISBLANK(B179)=TRUE,\" \", IF(B179='2. Metadata'!B$1,'2. Metadata'!B$5, IF(B179='2. Metadata'!C$1,'2. Metadata'!C$5,IF(B179='2. Metadata'!D$1,'2. Metadata'!D$5, IF(B179='2. Metadata'!E$1,'2. Metadata'!E$5,IF( B179='2. Metadata'!F$1,'2. Metadata'!F$5,IF(B179='2. Metadata'!G$1,'2. Metadata'!G$5,IF(B179='2. Metadata'!H$1,'2. Metadata'!H$5, IF(B179='2. Metadata'!I$1,'2. Metadata'!I$5, IF(B179='2. Metadata'!J$1,'2. Metadata'!J$5, IF(B179='2. Metadata'!K$1,'2. Metadata'!K$5, IF(B179='2. Metadata'!L$1,'2. Metadata'!L$5, IF(B179='2. Metadata'!M$1,'2. Metadata'!M$5, IF(B179='2. Metadata'!N$1,'2. Metadata'!N$5))))))))))))))","v":49.97944},{"$f":"IF(ISBLANK(B179)=TRUE,\" \", IF(B179='2. Metadata'!B$1,'2. Metadata'!B$6, IF(B179='2. Metadata'!C$1,'2. Metadata'!C$6,IF(B179='2. Metadata'!D$1,'2. Metadata'!D$6, IF(B179='2. Metadata'!E$1,'2. Metadata'!E$6,IF( B179='2. Metadata'!F$1,'2. Metadata'!F$6,IF(B179='2. Metadata'!G$1,'2. Metadata'!G$6,IF(B179='2. Metadata'!H$1,'2. Metadata'!H$6, IF(B179='2. Metadata'!I$1,'2. Metadata'!I$6, IF(B179='2. Metadata'!J$1,'2. Metadata'!J$6, IF(B179='2. Metadata'!K$1,'2. Metadata'!K$6, IF(B179='2. Metadata'!L$1,'2. Metadata'!L$6, IF(B179='2. Metadata'!M$1,'2. Metadata'!M$6, IF(B179='2. Metadata'!N$1,'2. Metadata'!N$6))))))))))))))","v":-117.88417},"n/a",1.886,{"$f":"IF(ISBLANK(F179)=TRUE,\" \",'2. Metadata'!B$14)","v":"degrees Celsius"},1.317,{"$f":"IF(ISBLANK(H179)=TRUE,\" \",'2. Metadata'!B$26)","v":"degrees Celsius"},1.555,{"$f":"IF(ISBLANK(J179)=TRUE,\" \",'2. Metadata'!B$38)","v":"degrees Celsius"},"n/a"]
["2014-01-29","NECAR01",{"$f":"IF(ISBLANK(B180)=TRUE,\" \", IF(B180='2. Metadata'!B$1,'2. Metadata'!B$5, IF(B180='2. Metadata'!C$1,'2. Metadata'!C$5,IF(B180='2. Metadata'!D$1,'2. Metadata'!D$5, IF(B180='2. Metadata'!E$1,'2. Metadata'!E$5,IF( B180='2. Metadata'!F$1,'2. Metadata'!F$5,IF(B180='2. Metadata'!G$1,'2. Metadata'!G$5,IF(B180='2. Metadata'!H$1,'2. Metadata'!H$5, IF(B180='2. Metadata'!I$1,'2. Metadata'!I$5, IF(B180='2. Metadata'!J$1,'2. Metadata'!J$5, IF(B180='2. Metadata'!K$1,'2. Metadata'!K$5, IF(B180='2. Metadata'!L$1,'2. Metadata'!L$5, IF(B180='2. Metadata'!M$1,'2. Metadata'!M$5, IF(B180='2. Metadata'!N$1,'2. Metadata'!N$5))))))))))))))","v":49.97944},{"$f":"IF(ISBLANK(B180)=TRUE,\" \", IF(B180='2. Metadata'!B$1,'2. Metadata'!B$6, IF(B180='2. Metadata'!C$1,'2. Metadata'!C$6,IF(B180='2. Metadata'!D$1,'2. Metadata'!D$6, IF(B180='2. Metadata'!E$1,'2. Metadata'!E$6,IF( B180='2. Metadata'!F$1,'2. Metadata'!F$6,IF(B180='2. Metadata'!G$1,'2. Metadata'!G$6,IF(B180='2. Metadata'!H$1,'2. Metadata'!H$6, IF(B180='2. Metadata'!I$1,'2. Metadata'!I$6, IF(B180='2. Metadata'!J$1,'2. Metadata'!J$6, IF(B180='2. Metadata'!K$1,'2. Metadata'!K$6, IF(B180='2. Metadata'!L$1,'2. Metadata'!L$6, IF(B180='2. Metadata'!M$1,'2. Metadata'!M$6, IF(B180='2. Metadata'!N$1,'2. Metadata'!N$6))))))))))))))","v":-117.88417},"n/a",1.534,{"$f":"IF(ISBLANK(F180)=TRUE,\" \",'2. Metadata'!B$14)","v":"degrees Celsius"},0.962,{"$f":"IF(ISBLANK(H180)=TRUE,\" \",'2. Metadata'!B$26)","v":"degrees Celsius"},1.268,{"$f":"IF(ISBLANK(J180)=TRUE,\" \",'2. Metadata'!B$38)","v":"degrees Celsius"},"n/a"]
["2014-01-30","NECAR01",{"$f":"IF(ISBLANK(B181)=TRUE,\" \", IF(B181='2. Metadata'!B$1,'2. Metadata'!B$5, IF(B181='2. Metadata'!C$1,'2. Metadata'!C$5,IF(B181='2. Metadata'!D$1,'2. Metadata'!D$5, IF(B181='2. Metadata'!E$1,'2. Metadata'!E$5,IF( B181='2. Metadata'!F$1,'2. Metadata'!F$5,IF(B181='2. Metadata'!G$1,'2. Metadata'!G$5,IF(B181='2. Metadata'!H$1,'2. Metadata'!H$5, IF(B181='2. Metadata'!I$1,'2. Metadata'!I$5, IF(B181='2. Metadata'!J$1,'2. Metadata'!J$5, IF(B181='2. Metadata'!K$1,'2. Metadata'!K$5, IF(B181='2. Metadata'!L$1,'2. Metadata'!L$5, IF(B181='2. Metadata'!M$1,'2. Metadata'!M$5, IF(B181='2. Metadata'!N$1,'2. Metadata'!N$5))))))))))))))","v":49.97944},{"$f":"IF(ISBLANK(B181)=TRUE,\" \", IF(B181='2. Metadata'!B$1,'2. Metadata'!B$6, IF(B181='2. Metadata'!C$1,'2. Metadata'!C$6,IF(B181='2. Metadata'!D$1,'2. Metadata'!D$6, IF(B181='2. Metadata'!E$1,'2. Metadata'!E$6,IF( B181='2. Metadata'!F$1,'2. Metadata'!F$6,IF(B181='2. Metadata'!G$1,'2. Metadata'!G$6,IF(B181='2. Metadata'!H$1,'2. Metadata'!H$6, IF(B181='2. Metadata'!I$1,'2. Metadata'!I$6, IF(B181='2. Metadata'!J$1,'2. Metadata'!J$6, IF(B181='2. Metadata'!K$1,'2. Metadata'!K$6, IF(B181='2. Metadata'!L$1,'2. Metadata'!L$6, IF(B181='2. Metadata'!M$1,'2. Metadata'!M$6, IF(B181='2. Metadata'!N$1,'2. Metadata'!N$6))))))))))))))","v":-117.88417},"n/a",1.805,{"$f":"IF(ISBLANK(F181)=TRUE,\" \",'2. Metadata'!B$14)","v":"degrees Celsius"},1.017,{"$f":"IF(ISBLANK(H181)=TRUE,\" \",'2. Metadata'!B$26)","v":"degrees Celsius"},1.325,{"$f":"IF(ISBLANK(J181)=TRUE,\" \",'2. Metadata'!B$38)","v":"degrees Celsius"},"n/a"]
["2014-01-31","NECAR01",{"$f":"IF(ISBLANK(B182)=TRUE,\" \", IF(B182='2. Metadata'!B$1,'2. Metadata'!B$5, IF(B182='2. Metadata'!C$1,'2. Metadata'!C$5,IF(B182='2. Metadata'!D$1,'2. Metadata'!D$5, IF(B182='2. Metadata'!E$1,'2. Metadata'!E$5,IF( B182='2. Metadata'!F$1,'2. Metadata'!F$5,IF(B182='2. Metadata'!G$1,'2. Metadata'!G$5,IF(B182='2. Metadata'!H$1,'2. Metadata'!H$5, IF(B182='2. Metadata'!I$1,'2. Metadata'!I$5, IF(B182='2. Metadata'!J$1,'2. Metadata'!J$5, IF(B182='2. Metadata'!K$1,'2. Metadata'!K$5, IF(B182='2. Metadata'!L$1,'2. Metadata'!L$5, IF(B182='2. Metadata'!M$1,'2. Metadata'!M$5, IF(B182='2. Metadata'!N$1,'2. Metadata'!N$5))))))))))))))","v":49.97944},{"$f":"IF(ISBLANK(B182)=TRUE,\" \", IF(B182='2. Metadata'!B$1,'2. Metadata'!B$6, IF(B182='2. Metadata'!C$1,'2. Metadata'!C$6,IF(B182='2. Metadata'!D$1,'2. Metadata'!D$6, IF(B182='2. Metadata'!E$1,'2. Metadata'!E$6,IF( B182='2. Metadata'!F$1,'2. Metadata'!F$6,IF(B182='2. Metadata'!G$1,'2. Metadata'!G$6,IF(B182='2. Metadata'!H$1,'2. Metadata'!H$6, IF(B182='2. Metadata'!I$1,'2. Metadata'!I$6, IF(B182='2. Metadata'!J$1,'2. Metadata'!J$6, IF(B182='2. Metadata'!K$1,'2. Metadata'!K$6, IF(B182='2. Metadata'!L$1,'2. Metadata'!L$6, IF(B182='2. Metadata'!M$1,'2. Metadata'!M$6, IF(B182='2. Metadata'!N$1,'2. Metadata'!N$6))))))))))))))","v":-117.88417},"n/a",1.398,{"$f":"IF(ISBLANK(F182)=TRUE,\" \",'2. Metadata'!B$14)","v":"degrees Celsius"},0.356,{"$f":"IF(ISBLANK(H182)=TRUE,\" \",'2. Metadata'!B$26)","v":"degrees Celsius"},0.864,{"$f":"IF(ISBLANK(J182)=TRUE,\" \",'2. Metadata'!B$38)","v":"degrees Celsius"},"n/a"]
["2014-02-01","NECAR01",{"$f":"IF(ISBLANK(B183)=TRUE,\" \", IF(B183='2. Metadata'!B$1,'2. Metadata'!B$5, IF(B183='2. Metadata'!C$1,'2. Metadata'!C$5,IF(B183='2. Metadata'!D$1,'2. Metadata'!D$5, IF(B183='2. Metadata'!E$1,'2. Metadata'!E$5,IF( B183='2. Metadata'!F$1,'2. Metadata'!F$5,IF(B183='2. Metadata'!G$1,'2. Metadata'!G$5,IF(B183='2. Metadata'!H$1,'2. Metadata'!H$5, IF(B183='2. Metadata'!I$1,'2. Metadata'!I$5, IF(B183='2. Metadata'!J$1,'2. Metadata'!J$5, IF(B183='2. Metadata'!K$1,'2. Metadata'!K$5, IF(B183='2. Metadata'!L$1,'2. Metadata'!L$5, IF(B183='2. Metadata'!M$1,'2. Metadata'!M$5, IF(B183='2. Metadata'!N$1,'2. Metadata'!N$5))))))))))))))","v":49.97944},{"$f":"IF(ISBLANK(B183)=TRUE,\" \", IF(B183='2. Metadata'!B$1,'2. Metadata'!B$6, IF(B183='2. Metadata'!C$1,'2. Metadata'!C$6,IF(B183='2. Metadata'!D$1,'2. Metadata'!D$6, IF(B183='2. Metadata'!E$1,'2. Metadata'!E$6,IF( B183='2. Metadata'!F$1,'2. Metadata'!F$6,IF(B183='2. Metadata'!G$1,'2. Metadata'!G$6,IF(B183='2. Metadata'!H$1,'2. Metadata'!H$6, IF(B183='2. Metadata'!I$1,'2. Metadata'!I$6, IF(B183='2. Metadata'!J$1,'2. Metadata'!J$6, IF(B183='2. Metadata'!K$1,'2. Metadata'!K$6, IF(B183='2. Metadata'!L$1,'2. Metadata'!L$6, IF(B183='2. Metadata'!M$1,'2. Metadata'!M$6, IF(B183='2. Metadata'!N$1,'2. Metadata'!N$6))))))))))))))","v":-117.88417},"n/a",0.467,{"$f":"IF(ISBLANK(F183)=TRUE,\" \",'2. Metadata'!B$14)","v":"degrees Celsius"},-0.032,{"$f":"IF(ISBLANK(H183)=TRUE,\" \",'2. Metadata'!B$26)","v":"degrees Celsius"},0.109,{"$f":"IF(ISBLANK(J183)=TRUE,\" \",'2. Metadata'!B$38)","v":"degrees Celsius"},"n/a"]
["2014-02-02","NECAR01",{"$f":"IF(ISBLANK(B184)=TRUE,\" \", IF(B184='2. Metadata'!B$1,'2. Metadata'!B$5, IF(B184='2. Metadata'!C$1,'2. Metadata'!C$5,IF(B184='2. Metadata'!D$1,'2. Metadata'!D$5, IF(B184='2. Metadata'!E$1,'2. Metadata'!E$5,IF( B184='2. Metadata'!F$1,'2. Metadata'!F$5,IF(B184='2. Metadata'!G$1,'2. Metadata'!G$5,IF(B184='2. Metadata'!H$1,'2. Metadata'!H$5, IF(B184='2. Metadata'!I$1,'2. Metadata'!I$5, IF(B184='2. Metadata'!J$1,'2. Metadata'!J$5, IF(B184='2. Metadata'!K$1,'2. Metadata'!K$5, IF(B184='2. Metadata'!L$1,'2. Metadata'!L$5, IF(B184='2. Metadata'!M$1,'2. Metadata'!M$5, IF(B184='2. Metadata'!N$1,'2. Metadata'!N$5))))))))))))))","v":49.97944},{"$f":"IF(ISBLANK(B184)=TRUE,\" \", IF(B184='2. Metadata'!B$1,'2. Metadata'!B$6, IF(B184='2. Metadata'!C$1,'2. Metadata'!C$6,IF(B184='2. Metadata'!D$1,'2. Metadata'!D$6, IF(B184='2. Metadata'!E$1,'2. Metadata'!E$6,IF( B184='2. Metadata'!F$1,'2. Metadata'!F$6,IF(B184='2. Metadata'!G$1,'2. Metadata'!G$6,IF(B184='2. Metadata'!H$1,'2. Metadata'!H$6, IF(B184='2. Metadata'!I$1,'2. Metadata'!I$6, IF(B184='2. Metadata'!J$1,'2. Metadata'!J$6, IF(B184='2. Metadata'!K$1,'2. Metadata'!K$6, IF(B184='2. Metadata'!L$1,'2. Metadata'!L$6, IF(B184='2. Metadata'!M$1,'2. Metadata'!M$6, IF(B184='2. Metadata'!N$1,'2. Metadata'!N$6))))))))))))))","v":-117.88417},"n/a",-0.004,{"$f":"IF(ISBLANK(F184)=TRUE,\" \",'2. Metadata'!B$14)","v":"degrees Celsius"},-0.032,{"$f":"IF(ISBLANK(H184)=TRUE,\" \",'2. Metadata'!B$26)","v":"degrees Celsius"},-0.023,{"$f":"IF(ISBLANK(J184)=TRUE,\" \",'2. Metadata'!B$38)","v":"degrees Celsius"},"n/a"]
["2014-02-03","NECAR01",{"$f":"IF(ISBLANK(B185)=TRUE,\" \", IF(B185='2. Metadata'!B$1,'2. Metadata'!B$5, IF(B185='2. Metadata'!C$1,'2. Metadata'!C$5,IF(B185='2. Metadata'!D$1,'2. Metadata'!D$5, IF(B185='2. Metadata'!E$1,'2. Metadata'!E$5,IF( B185='2. Metadata'!F$1,'2. Metadata'!F$5,IF(B185='2. Metadata'!G$1,'2. Metadata'!G$5,IF(B185='2. Metadata'!H$1,'2. Metadata'!H$5, IF(B185='2. Metadata'!I$1,'2. Metadata'!I$5, IF(B185='2. Metadata'!J$1,'2. Metadata'!J$5, IF(B185='2. Metadata'!K$1,'2. Metadata'!K$5, IF(B185='2. Metadata'!L$1,'2. Metadata'!L$5, IF(B185='2. Metadata'!M$1,'2. Metadata'!M$5, IF(B185='2. Metadata'!N$1,'2. Metadata'!N$5))))))))))))))","v":49.97944},{"$f":"IF(ISBLANK(B185)=TRUE,\" \", IF(B185='2. Metadata'!B$1,'2. Metadata'!B$6, IF(B185='2. Metadata'!C$1,'2. Metadata'!C$6,IF(B185='2. Metadata'!D$1,'2. Metadata'!D$6, IF(B185='2. Metadata'!E$1,'2. Metadata'!E$6,IF( B185='2. Metadata'!F$1,'2. Metadata'!F$6,IF(B185='2. Metadata'!G$1,'2. Metadata'!G$6,IF(B185='2. Metadata'!H$1,'2. Metadata'!H$6, IF(B185='2. Metadata'!I$1,'2. Metadata'!I$6, IF(B185='2. Metadata'!J$1,'2. Metadata'!J$6, IF(B185='2. Metadata'!K$1,'2. Metadata'!K$6, IF(B185='2. Metadata'!L$1,'2. Metadata'!L$6, IF(B185='2. Metadata'!M$1,'2. Metadata'!M$6, IF(B185='2. Metadata'!N$1,'2. Metadata'!N$6))))))))))))))","v":-117.88417},"n/a",-0.004,{"$f":"IF(ISBLANK(F185)=TRUE,\" \",'2. Metadata'!B$14)","v":"degrees Celsius"},-0.032,{"$f":"IF(ISBLANK(H185)=TRUE,\" \",'2. Metadata'!B$26)","v":"degrees Celsius"},-0.02,{"$f":"IF(ISBLANK(J185)=TRUE,\" \",'2. Metadata'!B$38)","v":"degrees Celsius"},"n/a"]
["2014-02-04","NECAR01",{"$f":"IF(ISBLANK(B186)=TRUE,\" \", IF(B186='2. Metadata'!B$1,'2. Metadata'!B$5, IF(B186='2. Metadata'!C$1,'2. Metadata'!C$5,IF(B186='2. Metadata'!D$1,'2. Metadata'!D$5, IF(B186='2. Metadata'!E$1,'2. Metadata'!E$5,IF( B186='2. Metadata'!F$1,'2. Metadata'!F$5,IF(B186='2. Metadata'!G$1,'2. Metadata'!G$5,IF(B186='2. Metadata'!H$1,'2. Metadata'!H$5, IF(B186='2. Metadata'!I$1,'2. Metadata'!I$5, IF(B186='2. Metadata'!J$1,'2. Metadata'!J$5, IF(B186='2. Metadata'!K$1,'2. Metadata'!K$5, IF(B186='2. Metadata'!L$1,'2. Metadata'!L$5, IF(B186='2. Metadata'!M$1,'2. Metadata'!M$5, IF(B186='2. Metadata'!N$1,'2. Metadata'!N$5))))))))))))))","v":49.97944},{"$f":"IF(ISBLANK(B186)=TRUE,\" \", IF(B186='2. Metadata'!B$1,'2. Metadata'!B$6, IF(B186='2. Metadata'!C$1,'2. Metadata'!C$6,IF(B186='2. Metadata'!D$1,'2. Metadata'!D$6, IF(B186='2. Metadata'!E$1,'2. Metadata'!E$6,IF( B186='2. Metadata'!F$1,'2. Metadata'!F$6,IF(B186='2. Metadata'!G$1,'2. Metadata'!G$6,IF(B186='2. Metadata'!H$1,'2. Metadata'!H$6, IF(B186='2. Metadata'!I$1,'2. Metadata'!I$6, IF(B186='2. Metadata'!J$1,'2. Metadata'!J$6, IF(B186='2. Metadata'!K$1,'2. Metadata'!K$6, IF(B186='2. Metadata'!L$1,'2. Metadata'!L$6, IF(B186='2. Metadata'!M$1,'2. Metadata'!M$6, IF(B186='2. Metadata'!N$1,'2. Metadata'!N$6))))))))))))))","v":-117.88417},"n/a",-0.004,{"$f":"IF(ISBLANK(F186)=TRUE,\" \",'2. Metadata'!B$14)","v":"degrees Celsius"},-0.032,{"$f":"IF(ISBLANK(H186)=TRUE,\" \",'2. Metadata'!B$26)","v":"degrees Celsius"},-0.019,{"$f":"IF(ISBLANK(J186)=TRUE,\" \",'2. Metadata'!B$38)","v":"degrees Celsius"},"n/a"]
["2014-02-05","NECAR01",{"$f":"IF(ISBLANK(B187)=TRUE,\" \", IF(B187='2. Metadata'!B$1,'2. Metadata'!B$5, IF(B187='2. Metadata'!C$1,'2. Metadata'!C$5,IF(B187='2. Metadata'!D$1,'2. Metadata'!D$5, IF(B187='2. Metadata'!E$1,'2. Metadata'!E$5,IF( B187='2. Metadata'!F$1,'2. Metadata'!F$5,IF(B187='2. Metadata'!G$1,'2. Metadata'!G$5,IF(B187='2. Metadata'!H$1,'2. Metadata'!H$5, IF(B187='2. Metadata'!I$1,'2. Metadata'!I$5, IF(B187='2. Metadata'!J$1,'2. Metadata'!J$5, IF(B187='2. Metadata'!K$1,'2. Metadata'!K$5, IF(B187='2. Metadata'!L$1,'2. Metadata'!L$5, IF(B187='2. Metadata'!M$1,'2. Metadata'!M$5, IF(B187='2. Metadata'!N$1,'2. Metadata'!N$5))))))))))))))","v":49.97944},{"$f":"IF(ISBLANK(B187)=TRUE,\" \", IF(B187='2. Metadata'!B$1,'2. Metadata'!B$6, IF(B187='2. Metadata'!C$1,'2. Metadata'!C$6,IF(B187='2. Metadata'!D$1,'2. Metadata'!D$6, IF(B187='2. Metadata'!E$1,'2. Metadata'!E$6,IF( B187='2. Metadata'!F$1,'2. Metadata'!F$6,IF(B187='2. Metadata'!G$1,'2. Metadata'!G$6,IF(B187='2. Metadata'!H$1,'2. Metadata'!H$6, IF(B187='2. Metadata'!I$1,'2. Metadata'!I$6, IF(B187='2. Metadata'!J$1,'2. Metadata'!J$6, IF(B187='2. Metadata'!K$1,'2. Metadata'!K$6, IF(B187='2. Metadata'!L$1,'2. Metadata'!L$6, IF(B187='2. Metadata'!M$1,'2. Metadata'!M$6, IF(B187='2. Metadata'!N$1,'2. Metadata'!N$6))))))))))))))","v":-117.88417},"n/a",-0.004,{"$f":"IF(ISBLANK(F187)=TRUE,\" \",'2. Metadata'!B$14)","v":"degrees Celsius"},-0.032,{"$f":"IF(ISBLANK(H187)=TRUE,\" \",'2. Metadata'!B$26)","v":"degrees Celsius"},-0.023,{"$f":"IF(ISBLANK(J187)=TRUE,\" \",'2. Metadata'!B$38)","v":"degrees Celsius"},"n/a"]
["2014-02-06","NECAR01",{"$f":"IF(ISBLANK(B188)=TRUE,\" \", IF(B188='2. Metadata'!B$1,'2. Metadata'!B$5, IF(B188='2. Metadata'!C$1,'2. Metadata'!C$5,IF(B188='2. Metadata'!D$1,'2. Metadata'!D$5, IF(B188='2. Metadata'!E$1,'2. Metadata'!E$5,IF( B188='2. Metadata'!F$1,'2. Metadata'!F$5,IF(B188='2. Metadata'!G$1,'2. Metadata'!G$5,IF(B188='2. Metadata'!H$1,'2. Metadata'!H$5, IF(B188='2. Metadata'!I$1,'2. Metadata'!I$5, IF(B188='2. Metadata'!J$1,'2. Metadata'!J$5, IF(B188='2. Metadata'!K$1,'2. Metadata'!K$5, IF(B188='2. Metadata'!L$1,'2. Metadata'!L$5, IF(B188='2. Metadata'!M$1,'2. Metadata'!M$5, IF(B188='2. Metadata'!N$1,'2. Metadata'!N$5))))))))))))))","v":49.97944},{"$f":"IF(ISBLANK(B188)=TRUE,\" \", IF(B188='2. Metadata'!B$1,'2. Metadata'!B$6, IF(B188='2. Metadata'!C$1,'2. Metadata'!C$6,IF(B188='2. Metadata'!D$1,'2. Metadata'!D$6, IF(B188='2. Metadata'!E$1,'2. Metadata'!E$6,IF( B188='2. Metadata'!F$1,'2. Metadata'!F$6,IF(B188='2. Metadata'!G$1,'2. Metadata'!G$6,IF(B188='2. Metadata'!H$1,'2. Metadata'!H$6, IF(B188='2. Metadata'!I$1,'2. Metadata'!I$6, IF(B188='2. Metadata'!J$1,'2. Metadata'!J$6, IF(B188='2. Metadata'!K$1,'2. Metadata'!K$6, IF(B188='2. Metadata'!L$1,'2. Metadata'!L$6, IF(B188='2. Metadata'!M$1,'2. Metadata'!M$6, IF(B188='2. Metadata'!N$1,'2. Metadata'!N$6))))))))))))))","v":-117.88417},"n/a",-0.004,{"$f":"IF(ISBLANK(F188)=TRUE,\" \",'2. Metadata'!B$14)","v":"degrees Celsius"},-0.032,{"$f":"IF(ISBLANK(H188)=TRUE,\" \",'2. Metadata'!B$26)","v":"degrees Celsius"},-0.021,{"$f":"IF(ISBLANK(J188)=TRUE,\" \",'2. Metadata'!B$38)","v":"degrees Celsius"},"n/a"]
["2014-02-07","NECAR01",{"$f":"IF(ISBLANK(B189)=TRUE,\" \", IF(B189='2. Metadata'!B$1,'2. Metadata'!B$5, IF(B189='2. Metadata'!C$1,'2. Metadata'!C$5,IF(B189='2. Metadata'!D$1,'2. Metadata'!D$5, IF(B189='2. Metadata'!E$1,'2. Metadata'!E$5,IF( B189='2. Metadata'!F$1,'2. Metadata'!F$5,IF(B189='2. Metadata'!G$1,'2. Metadata'!G$5,IF(B189='2. Metadata'!H$1,'2. Metadata'!H$5, IF(B189='2. Metadata'!I$1,'2. Metadata'!I$5, IF(B189='2. Metadata'!J$1,'2. Metadata'!J$5, IF(B189='2. Metadata'!K$1,'2. Metadata'!K$5, IF(B189='2. Metadata'!L$1,'2. Metadata'!L$5, IF(B189='2. Metadata'!M$1,'2. Metadata'!M$5, IF(B189='2. Metadata'!N$1,'2. Metadata'!N$5))))))))))))))","v":49.97944},{"$f":"IF(ISBLANK(B189)=TRUE,\" \", IF(B189='2. Metadata'!B$1,'2. Metadata'!B$6, IF(B189='2. Metadata'!C$1,'2. Metadata'!C$6,IF(B189='2. Metadata'!D$1,'2. Metadata'!D$6, IF(B189='2. Metadata'!E$1,'2. Metadata'!E$6,IF( B189='2. Metadata'!F$1,'2. Metadata'!F$6,IF(B189='2. Metadata'!G$1,'2. Metadata'!G$6,IF(B189='2. Metadata'!H$1,'2. Metadata'!H$6, IF(B189='2. Metadata'!I$1,'2. Metadata'!I$6, IF(B189='2. Metadata'!J$1,'2. Metadata'!J$6, IF(B189='2. Metadata'!K$1,'2. Metadata'!K$6, IF(B189='2. Metadata'!L$1,'2. Metadata'!L$6, IF(B189='2. Metadata'!M$1,'2. Metadata'!M$6, IF(B189='2. Metadata'!N$1,'2. Metadata'!N$6))))))))))))))","v":-117.88417},"n/a",-0.004,{"$f":"IF(ISBLANK(F189)=TRUE,\" \",'2. Metadata'!B$14)","v":"degrees Celsius"},-0.032,{"$f":"IF(ISBLANK(H189)=TRUE,\" \",'2. Metadata'!B$26)","v":"degrees Celsius"},-0.013,{"$f":"IF(ISBLANK(J189)=TRUE,\" \",'2. Metadata'!B$38)","v":"degrees Celsius"},"n/a"]
["2014-02-08","NECAR01",{"$f":"IF(ISBLANK(B190)=TRUE,\" \", IF(B190='2. Metadata'!B$1,'2. Metadata'!B$5, IF(B190='2. Metadata'!C$1,'2. Metadata'!C$5,IF(B190='2. Metadata'!D$1,'2. Metadata'!D$5, IF(B190='2. Metadata'!E$1,'2. Metadata'!E$5,IF( B190='2. Metadata'!F$1,'2. Metadata'!F$5,IF(B190='2. Metadata'!G$1,'2. Metadata'!G$5,IF(B190='2. Metadata'!H$1,'2. Metadata'!H$5, IF(B190='2. Metadata'!I$1,'2. Metadata'!I$5, IF(B190='2. Metadata'!J$1,'2. Metadata'!J$5, IF(B190='2. Metadata'!K$1,'2. Metadata'!K$5, IF(B190='2. Metadata'!L$1,'2. Metadata'!L$5, IF(B190='2. Metadata'!M$1,'2. Metadata'!M$5, IF(B190='2. Metadata'!N$1,'2. Metadata'!N$5))))))))))))))","v":49.97944},{"$f":"IF(ISBLANK(B190)=TRUE,\" \", IF(B190='2. Metadata'!B$1,'2. Metadata'!B$6, IF(B190='2. Metadata'!C$1,'2. Metadata'!C$6,IF(B190='2. Metadata'!D$1,'2. Metadata'!D$6, IF(B190='2. Metadata'!E$1,'2. Metadata'!E$6,IF( B190='2. Metadata'!F$1,'2. Metadata'!F$6,IF(B190='2. Metadata'!G$1,'2. Metadata'!G$6,IF(B190='2. Metadata'!H$1,'2. Metadata'!H$6, IF(B190='2. Metadata'!I$1,'2. Metadata'!I$6, IF(B190='2. Metadata'!J$1,'2. Metadata'!J$6, IF(B190='2. Metadata'!K$1,'2. Metadata'!K$6, IF(B190='2. Metadata'!L$1,'2. Metadata'!L$6, IF(B190='2. Metadata'!M$1,'2. Metadata'!M$6, IF(B190='2. Metadata'!N$1,'2. Metadata'!N$6))))))))))))))","v":-117.88417},"n/a",-0.004,{"$f":"IF(ISBLANK(F190)=TRUE,\" \",'2. Metadata'!B$14)","v":"degrees Celsius"},-0.032,{"$f":"IF(ISBLANK(H190)=TRUE,\" \",'2. Metadata'!B$26)","v":"degrees Celsius"},-0.012,{"$f":"IF(ISBLANK(J190)=TRUE,\" \",'2. Metadata'!B$38)","v":"degrees Celsius"},"n/a"]
["2014-02-09","NECAR01",{"$f":"IF(ISBLANK(B191)=TRUE,\" \", IF(B191='2. Metadata'!B$1,'2. Metadata'!B$5, IF(B191='2. Metadata'!C$1,'2. Metadata'!C$5,IF(B191='2. Metadata'!D$1,'2. Metadata'!D$5, IF(B191='2. Metadata'!E$1,'2. Metadata'!E$5,IF( B191='2. Metadata'!F$1,'2. Metadata'!F$5,IF(B191='2. Metadata'!G$1,'2. Metadata'!G$5,IF(B191='2. Metadata'!H$1,'2. Metadata'!H$5, IF(B191='2. Metadata'!I$1,'2. Metadata'!I$5, IF(B191='2. Metadata'!J$1,'2. Metadata'!J$5, IF(B191='2. Metadata'!K$1,'2. Metadata'!K$5, IF(B191='2. Metadata'!L$1,'2. Metadata'!L$5, IF(B191='2. Metadata'!M$1,'2. Metadata'!M$5, IF(B191='2. Metadata'!N$1,'2. Metadata'!N$5))))))))))))))","v":49.97944},{"$f":"IF(ISBLANK(B191)=TRUE,\" \", IF(B191='2. Metadata'!B$1,'2. Metadata'!B$6, IF(B191='2. Metadata'!C$1,'2. Metadata'!C$6,IF(B191='2. Metadata'!D$1,'2. Metadata'!D$6, IF(B191='2. Metadata'!E$1,'2. Metadata'!E$6,IF( B191='2. Metadata'!F$1,'2. Metadata'!F$6,IF(B191='2. Metadata'!G$1,'2. Metadata'!G$6,IF(B191='2. Metadata'!H$1,'2. Metadata'!H$6, IF(B191='2. Metadata'!I$1,'2. Metadata'!I$6, IF(B191='2. Metadata'!J$1,'2. Metadata'!J$6, IF(B191='2. Metadata'!K$1,'2. Metadata'!K$6, IF(B191='2. Metadata'!L$1,'2. Metadata'!L$6, IF(B191='2. Metadata'!M$1,'2. Metadata'!M$6, IF(B191='2. Metadata'!N$1,'2. Metadata'!N$6))))))))))))))","v":-117.88417},"n/a",-0.004,{"$f":"IF(ISBLANK(F191)=TRUE,\" \",'2. Metadata'!B$14)","v":"degrees Celsius"},-0.032,{"$f":"IF(ISBLANK(H191)=TRUE,\" \",'2. Metadata'!B$26)","v":"degrees Celsius"},-0.011,{"$f":"IF(ISBLANK(J191)=TRUE,\" \",'2. Metadata'!B$38)","v":"degrees Celsius"},"n/a"]
["2014-02-10","NECAR01",{"$f":"IF(ISBLANK(B192)=TRUE,\" \", IF(B192='2. Metadata'!B$1,'2. Metadata'!B$5, IF(B192='2. Metadata'!C$1,'2. Metadata'!C$5,IF(B192='2. Metadata'!D$1,'2. Metadata'!D$5, IF(B192='2. Metadata'!E$1,'2. Metadata'!E$5,IF( B192='2. Metadata'!F$1,'2. Metadata'!F$5,IF(B192='2. Metadata'!G$1,'2. Metadata'!G$5,IF(B192='2. Metadata'!H$1,'2. Metadata'!H$5, IF(B192='2. Metadata'!I$1,'2. Metadata'!I$5, IF(B192='2. Metadata'!J$1,'2. Metadata'!J$5, IF(B192='2. Metadata'!K$1,'2. Metadata'!K$5, IF(B192='2. Metadata'!L$1,'2. Metadata'!L$5, IF(B192='2. Metadata'!M$1,'2. Metadata'!M$5, IF(B192='2. Metadata'!N$1,'2. Metadata'!N$5))))))))))))))","v":49.97944},{"$f":"IF(ISBLANK(B192)=TRUE,\" \", IF(B192='2. Metadata'!B$1,'2. Metadata'!B$6, IF(B192='2. Metadata'!C$1,'2. Metadata'!C$6,IF(B192='2. Metadata'!D$1,'2. Metadata'!D$6, IF(B192='2. Metadata'!E$1,'2. Metadata'!E$6,IF( B192='2. Metadata'!F$1,'2. Metadata'!F$6,IF(B192='2. Metadata'!G$1,'2. Metadata'!G$6,IF(B192='2. Metadata'!H$1,'2. Metadata'!H$6, IF(B192='2. Metadata'!I$1,'2. Metadata'!I$6, IF(B192='2. Metadata'!J$1,'2. Metadata'!J$6, IF(B192='2. Metadata'!K$1,'2. Metadata'!K$6, IF(B192='2. Metadata'!L$1,'2. Metadata'!L$6, IF(B192='2. Metadata'!M$1,'2. Metadata'!M$6, IF(B192='2. Metadata'!N$1,'2. Metadata'!N$6))))))))))))))","v":-117.88417},"n/a",-0.004,{"$f":"IF(ISBLANK(F192)=TRUE,\" \",'2. Metadata'!B$14)","v":"degrees Celsius"},-0.032,{"$f":"IF(ISBLANK(H192)=TRUE,\" \",'2. Metadata'!B$26)","v":"degrees Celsius"},-0.005,{"$f":"IF(ISBLANK(J192)=TRUE,\" \",'2. Metadata'!B$38)","v":"degrees Celsius"},"n/a"]
["2014-02-11","NECAR01",{"$f":"IF(ISBLANK(B193)=TRUE,\" \", IF(B193='2. Metadata'!B$1,'2. Metadata'!B$5, IF(B193='2. Metadata'!C$1,'2. Metadata'!C$5,IF(B193='2. Metadata'!D$1,'2. Metadata'!D$5, IF(B193='2. Metadata'!E$1,'2. Metadata'!E$5,IF( B193='2. Metadata'!F$1,'2. Metadata'!F$5,IF(B193='2. Metadata'!G$1,'2. Metadata'!G$5,IF(B193='2. Metadata'!H$1,'2. Metadata'!H$5, IF(B193='2. Metadata'!I$1,'2. Metadata'!I$5, IF(B193='2. Metadata'!J$1,'2. Metadata'!J$5, IF(B193='2. Metadata'!K$1,'2. Metadata'!K$5, IF(B193='2. Metadata'!L$1,'2. Metadata'!L$5, IF(B193='2. Metadata'!M$1,'2. Metadata'!M$5, IF(B193='2. Metadata'!N$1,'2. Metadata'!N$5))))))))))))))","v":49.97944},{"$f":"IF(ISBLANK(B193)=TRUE,\" \", IF(B193='2. Metadata'!B$1,'2. Metadata'!B$6, IF(B193='2. Metadata'!C$1,'2. Metadata'!C$6,IF(B193='2. Metadata'!D$1,'2. Metadata'!D$6, IF(B193='2. Metadata'!E$1,'2. Metadata'!E$6,IF( B193='2. Metadata'!F$1,'2. Metadata'!F$6,IF(B193='2. Metadata'!G$1,'2. Metadata'!G$6,IF(B193='2. Metadata'!H$1,'2. Metadata'!H$6, IF(B193='2. Metadata'!I$1,'2. Metadata'!I$6, IF(B193='2. Metadata'!J$1,'2. Metadata'!J$6, IF(B193='2. Metadata'!K$1,'2. Metadata'!K$6, IF(B193='2. Metadata'!L$1,'2. Metadata'!L$6, IF(B193='2. Metadata'!M$1,'2. Metadata'!M$6, IF(B193='2. Metadata'!N$1,'2. Metadata'!N$6))))))))))))))","v":-117.88417},"n/a",-0.004,{"$f":"IF(ISBLANK(F193)=TRUE,\" \",'2. Metadata'!B$14)","v":"degrees Celsius"},-0.004,{"$f":"IF(ISBLANK(H193)=TRUE,\" \",'2. Metadata'!B$26)","v":"degrees Celsius"},-0.004,{"$f":"IF(ISBLANK(J193)=TRUE,\" \",'2. Metadata'!B$38)","v":"degrees Celsius"},"n/a"]
["2014-02-12","NECAR01",{"$f":"IF(ISBLANK(B194)=TRUE,\" \", IF(B194='2. Metadata'!B$1,'2. Metadata'!B$5, IF(B194='2. Metadata'!C$1,'2. Metadata'!C$5,IF(B194='2. Metadata'!D$1,'2. Metadata'!D$5, IF(B194='2. Metadata'!E$1,'2. Metadata'!E$5,IF( B194='2. Metadata'!F$1,'2. Metadata'!F$5,IF(B194='2. Metadata'!G$1,'2. Metadata'!G$5,IF(B194='2. Metadata'!H$1,'2. Metadata'!H$5, IF(B194='2. Metadata'!I$1,'2. Metadata'!I$5, IF(B194='2. Metadata'!J$1,'2. Metadata'!J$5, IF(B194='2. Metadata'!K$1,'2. Metadata'!K$5, IF(B194='2. Metadata'!L$1,'2. Metadata'!L$5, IF(B194='2. Metadata'!M$1,'2. Metadata'!M$5, IF(B194='2. Metadata'!N$1,'2. Metadata'!N$5))))))))))))))","v":49.97944},{"$f":"IF(ISBLANK(B194)=TRUE,\" \", IF(B194='2. Metadata'!B$1,'2. Metadata'!B$6, IF(B194='2. Metadata'!C$1,'2. Metadata'!C$6,IF(B194='2. Metadata'!D$1,'2. Metadata'!D$6, IF(B194='2. Metadata'!E$1,'2. Metadata'!E$6,IF( B194='2. Metadata'!F$1,'2. Metadata'!F$6,IF(B194='2. Metadata'!G$1,'2. Metadata'!G$6,IF(B194='2. Metadata'!H$1,'2. Metadata'!H$6, IF(B194='2. Metadata'!I$1,'2. Metadata'!I$6, IF(B194='2. Metadata'!J$1,'2. Metadata'!J$6, IF(B194='2. Metadata'!K$1,'2. Metadata'!K$6, IF(B194='2. Metadata'!L$1,'2. Metadata'!L$6, IF(B194='2. Metadata'!M$1,'2. Metadata'!M$6, IF(B194='2. Metadata'!N$1,'2. Metadata'!N$6))))))))))))))","v":-117.88417},"n/a",-0.004,{"$f":"IF(ISBLANK(F194)=TRUE,\" \",'2. Metadata'!B$14)","v":"degrees Celsius"},-0.004,{"$f":"IF(ISBLANK(H194)=TRUE,\" \",'2. Metadata'!B$26)","v":"degrees Celsius"},-0.004,{"$f":"IF(ISBLANK(J194)=TRUE,\" \",'2. Metadata'!B$38)","v":"degrees Celsius"},"n/a"]
["2014-02-13","NECAR01",{"$f":"IF(ISBLANK(B195)=TRUE,\" \", IF(B195='2. Metadata'!B$1,'2. Metadata'!B$5, IF(B195='2. Metadata'!C$1,'2. Metadata'!C$5,IF(B195='2. Metadata'!D$1,'2. Metadata'!D$5, IF(B195='2. Metadata'!E$1,'2. Metadata'!E$5,IF( B195='2. Metadata'!F$1,'2. Metadata'!F$5,IF(B195='2. Metadata'!G$1,'2. Metadata'!G$5,IF(B195='2. Metadata'!H$1,'2. Metadata'!H$5, IF(B195='2. Metadata'!I$1,'2. Metadata'!I$5, IF(B195='2. Metadata'!J$1,'2. Metadata'!J$5, IF(B195='2. Metadata'!K$1,'2. Metadata'!K$5, IF(B195='2. Metadata'!L$1,'2. Metadata'!L$5, IF(B195='2. Metadata'!M$1,'2. Metadata'!M$5, IF(B195='2. Metadata'!N$1,'2. Metadata'!N$5))))))))))))))","v":49.97944},{"$f":"IF(ISBLANK(B195)=TRUE,\" \", IF(B195='2. Metadata'!B$1,'2. Metadata'!B$6, IF(B195='2. Metadata'!C$1,'2. Metadata'!C$6,IF(B195='2. Metadata'!D$1,'2. Metadata'!D$6, IF(B195='2. Metadata'!E$1,'2. Metadata'!E$6,IF( B195='2. Metadata'!F$1,'2. Metadata'!F$6,IF(B195='2. Metadata'!G$1,'2. Metadata'!G$6,IF(B195='2. Metadata'!H$1,'2. Metadata'!H$6, IF(B195='2. Metadata'!I$1,'2. Metadata'!I$6, IF(B195='2. Metadata'!J$1,'2. Metadata'!J$6, IF(B195='2. Metadata'!K$1,'2. Metadata'!K$6, IF(B195='2. Metadata'!L$1,'2. Metadata'!L$6, IF(B195='2. Metadata'!M$1,'2. Metadata'!M$6, IF(B195='2. Metadata'!N$1,'2. Metadata'!N$6))))))))))))))","v":-117.88417},"n/a",-0.004,{"$f":"IF(ISBLANK(F195)=TRUE,\" \",'2. Metadata'!B$14)","v":"degrees Celsius"},-0.004,{"$f":"IF(ISBLANK(H195)=TRUE,\" \",'2. Metadata'!B$26)","v":"degrees Celsius"},-0.004,{"$f":"IF(ISBLANK(J195)=TRUE,\" \",'2. Metadata'!B$38)","v":"degrees Celsius"},"n/a"]
["2014-02-14","NECAR01",{"$f":"IF(ISBLANK(B196)=TRUE,\" \", IF(B196='2. Metadata'!B$1,'2. Metadata'!B$5, IF(B196='2. Metadata'!C$1,'2. Metadata'!C$5,IF(B196='2. Metadata'!D$1,'2. Metadata'!D$5, IF(B196='2. Metadata'!E$1,'2. Metadata'!E$5,IF( B196='2. Metadata'!F$1,'2. Metadata'!F$5,IF(B196='2. Metadata'!G$1,'2. Metadata'!G$5,IF(B196='2. Metadata'!H$1,'2. Metadata'!H$5, IF(B196='2. Metadata'!I$1,'2. Metadata'!I$5, IF(B196='2. Metadata'!J$1,'2. Metadata'!J$5, IF(B196='2. Metadata'!K$1,'2. Metadata'!K$5, IF(B196='2. Metadata'!L$1,'2. Metadata'!L$5, IF(B196='2. Metadata'!M$1,'2. Metadata'!M$5, IF(B196='2. Metadata'!N$1,'2. Metadata'!N$5))))))))))))))","v":49.97944},{"$f":"IF(ISBLANK(B196)=TRUE,\" \", IF(B196='2. Metadata'!B$1,'2. Metadata'!B$6, IF(B196='2. Metadata'!C$1,'2. Metadata'!C$6,IF(B196='2. Metadata'!D$1,'2. Metadata'!D$6, IF(B196='2. Metadata'!E$1,'2. Metadata'!E$6,IF( B196='2. Metadata'!F$1,'2. Metadata'!F$6,IF(B196='2. Metadata'!G$1,'2. Metadata'!G$6,IF(B196='2. Metadata'!H$1,'2. Metadata'!H$6, IF(B196='2. Metadata'!I$1,'2. Metadata'!I$6, IF(B196='2. Metadata'!J$1,'2. Metadata'!J$6, IF(B196='2. Metadata'!K$1,'2. Metadata'!K$6, IF(B196='2. Metadata'!L$1,'2. Metadata'!L$6, IF(B196='2. Metadata'!M$1,'2. Metadata'!M$6, IF(B196='2. Metadata'!N$1,'2. Metadata'!N$6))))))))))))))","v":-117.88417},"n/a",-0.004,{"$f":"IF(ISBLANK(F196)=TRUE,\" \",'2. Metadata'!B$14)","v":"degrees Celsius"},-0.004,{"$f":"IF(ISBLANK(H196)=TRUE,\" \",'2. Metadata'!B$26)","v":"degrees Celsius"},-0.004,{"$f":"IF(ISBLANK(J196)=TRUE,\" \",'2. Metadata'!B$38)","v":"degrees Celsius"},"n/a"]
["2014-02-15","NECAR01",{"$f":"IF(ISBLANK(B197)=TRUE,\" \", IF(B197='2. Metadata'!B$1,'2. Metadata'!B$5, IF(B197='2. Metadata'!C$1,'2. Metadata'!C$5,IF(B197='2. Metadata'!D$1,'2. Metadata'!D$5, IF(B197='2. Metadata'!E$1,'2. Metadata'!E$5,IF( B197='2. Metadata'!F$1,'2. Metadata'!F$5,IF(B197='2. Metadata'!G$1,'2. Metadata'!G$5,IF(B197='2. Metadata'!H$1,'2. Metadata'!H$5, IF(B197='2. Metadata'!I$1,'2. Metadata'!I$5, IF(B197='2. Metadata'!J$1,'2. Metadata'!J$5, IF(B197='2. Metadata'!K$1,'2. Metadata'!K$5, IF(B197='2. Metadata'!L$1,'2. Metadata'!L$5, IF(B197='2. Metadata'!M$1,'2. Metadata'!M$5, IF(B197='2. Metadata'!N$1,'2. Metadata'!N$5))))))))))))))","v":49.97944},{"$f":"IF(ISBLANK(B197)=TRUE,\" \", IF(B197='2. Metadata'!B$1,'2. Metadata'!B$6, IF(B197='2. Metadata'!C$1,'2. Metadata'!C$6,IF(B197='2. Metadata'!D$1,'2. Metadata'!D$6, IF(B197='2. Metadata'!E$1,'2. Metadata'!E$6,IF( B197='2. Metadata'!F$1,'2. Metadata'!F$6,IF(B197='2. Metadata'!G$1,'2. Metadata'!G$6,IF(B197='2. Metadata'!H$1,'2. Metadata'!H$6, IF(B197='2. Metadata'!I$1,'2. Metadata'!I$6, IF(B197='2. Metadata'!J$1,'2. Metadata'!J$6, IF(B197='2. Metadata'!K$1,'2. Metadata'!K$6, IF(B197='2. Metadata'!L$1,'2. Metadata'!L$6, IF(B197='2. Metadata'!M$1,'2. Metadata'!M$6, IF(B197='2. Metadata'!N$1,'2. Metadata'!N$6))))))))))))))","v":-117.88417},"n/a",-0.004,{"$f":"IF(ISBLANK(F197)=TRUE,\" \",'2. Metadata'!B$14)","v":"degrees Celsius"},-0.004,{"$f":"IF(ISBLANK(H197)=TRUE,\" \",'2. Metadata'!B$26)","v":"degrees Celsius"},-0.004,{"$f":"IF(ISBLANK(J197)=TRUE,\" \",'2. Metadata'!B$38)","v":"degrees Celsius"},"n/a"]
["2014-02-16","NECAR01",{"$f":"IF(ISBLANK(B198)=TRUE,\" \", IF(B198='2. Metadata'!B$1,'2. Metadata'!B$5, IF(B198='2. Metadata'!C$1,'2. Metadata'!C$5,IF(B198='2. Metadata'!D$1,'2. Metadata'!D$5, IF(B198='2. Metadata'!E$1,'2. Metadata'!E$5,IF( B198='2. Metadata'!F$1,'2. Metadata'!F$5,IF(B198='2. Metadata'!G$1,'2. Metadata'!G$5,IF(B198='2. Metadata'!H$1,'2. Metadata'!H$5, IF(B198='2. Metadata'!I$1,'2. Metadata'!I$5, IF(B198='2. Metadata'!J$1,'2. Metadata'!J$5, IF(B198='2. Metadata'!K$1,'2. Metadata'!K$5, IF(B198='2. Metadata'!L$1,'2. Metadata'!L$5, IF(B198='2. Metadata'!M$1,'2. Metadata'!M$5, IF(B198='2. Metadata'!N$1,'2. Metadata'!N$5))))))))))))))","v":49.97944},{"$f":"IF(ISBLANK(B198)=TRUE,\" \", IF(B198='2. Metadata'!B$1,'2. Metadata'!B$6, IF(B198='2. Metadata'!C$1,'2. Metadata'!C$6,IF(B198='2. Metadata'!D$1,'2. Metadata'!D$6, IF(B198='2. Metadata'!E$1,'2. Metadata'!E$6,IF( B198='2. Metadata'!F$1,'2. Metadata'!F$6,IF(B198='2. Metadata'!G$1,'2. Metadata'!G$6,IF(B198='2. Metadata'!H$1,'2. Metadata'!H$6, IF(B198='2. Metadata'!I$1,'2. Metadata'!I$6, IF(B198='2. Metadata'!J$1,'2. Metadata'!J$6, IF(B198='2. Metadata'!K$1,'2. Metadata'!K$6, IF(B198='2. Metadata'!L$1,'2. Metadata'!L$6, IF(B198='2. Metadata'!M$1,'2. Metadata'!M$6, IF(B198='2. Metadata'!N$1,'2. Metadata'!N$6))))))))))))))","v":-117.88417},"n/a",0.55,{"$f":"IF(ISBLANK(F198)=TRUE,\" \",'2. Metadata'!B$14)","v":"degrees Celsius"},-0.004,{"$f":"IF(ISBLANK(H198)=TRUE,\" \",'2. Metadata'!B$26)","v":"degrees Celsius"},0.158,{"$f":"IF(ISBLANK(J198)=TRUE,\" \",'2. Metadata'!B$38)","v":"degrees Celsius"},"n/a"]
["2014-02-17","NECAR01",{"$f":"IF(ISBLANK(B199)=TRUE,\" \", IF(B199='2. Metadata'!B$1,'2. Metadata'!B$5, IF(B199='2. Metadata'!C$1,'2. Metadata'!C$5,IF(B199='2. Metadata'!D$1,'2. Metadata'!D$5, IF(B199='2. Metadata'!E$1,'2. Metadata'!E$5,IF( B199='2. Metadata'!F$1,'2. Metadata'!F$5,IF(B199='2. Metadata'!G$1,'2. Metadata'!G$5,IF(B199='2. Metadata'!H$1,'2. Metadata'!H$5, IF(B199='2. Metadata'!I$1,'2. Metadata'!I$5, IF(B199='2. Metadata'!J$1,'2. Metadata'!J$5, IF(B199='2. Metadata'!K$1,'2. Metadata'!K$5, IF(B199='2. Metadata'!L$1,'2. Metadata'!L$5, IF(B199='2. Metadata'!M$1,'2. Metadata'!M$5, IF(B199='2. Metadata'!N$1,'2. Metadata'!N$5))))))))))))))","v":49.97944},{"$f":"IF(ISBLANK(B199)=TRUE,\" \", IF(B199='2. Metadata'!B$1,'2. Metadata'!B$6, IF(B199='2. Metadata'!C$1,'2. Metadata'!C$6,IF(B199='2. Metadata'!D$1,'2. Metadata'!D$6, IF(B199='2. Metadata'!E$1,'2. Metadata'!E$6,IF( B199='2. Metadata'!F$1,'2. Metadata'!F$6,IF(B199='2. Metadata'!G$1,'2. Metadata'!G$6,IF(B199='2. Metadata'!H$1,'2. Metadata'!H$6, IF(B199='2. Metadata'!I$1,'2. Metadata'!I$6, IF(B199='2. Metadata'!J$1,'2. Metadata'!J$6, IF(B199='2. Metadata'!K$1,'2. Metadata'!K$6, IF(B199='2. Metadata'!L$1,'2. Metadata'!L$6, IF(B199='2. Metadata'!M$1,'2. Metadata'!M$6, IF(B199='2. Metadata'!N$1,'2. Metadata'!N$6))))))))))))))","v":-117.88417},"n/a",1.453,{"$f":"IF(ISBLANK(F199)=TRUE,\" \",'2. Metadata'!B$14)","v":"degrees Celsius"},0.55,{"$f":"IF(ISBLANK(H199)=TRUE,\" \",'2. Metadata'!B$26)","v":"degrees Celsius"},0.987,{"$f":"IF(ISBLANK(J199)=TRUE,\" \",'2. Metadata'!B$38)","v":"degrees Celsius"},"n/a"]
["2014-02-18","NECAR01",{"$f":"IF(ISBLANK(B200)=TRUE,\" \", IF(B200='2. Metadata'!B$1,'2. Metadata'!B$5, IF(B200='2. Metadata'!C$1,'2. Metadata'!C$5,IF(B200='2. Metadata'!D$1,'2. Metadata'!D$5, IF(B200='2. Metadata'!E$1,'2. Metadata'!E$5,IF( B200='2. Metadata'!F$1,'2. Metadata'!F$5,IF(B200='2. Metadata'!G$1,'2. Metadata'!G$5,IF(B200='2. Metadata'!H$1,'2. Metadata'!H$5, IF(B200='2. Metadata'!I$1,'2. Metadata'!I$5, IF(B200='2. Metadata'!J$1,'2. Metadata'!J$5, IF(B200='2. Metadata'!K$1,'2. Metadata'!K$5, IF(B200='2. Metadata'!L$1,'2. Metadata'!L$5, IF(B200='2. Metadata'!M$1,'2. Metadata'!M$5, IF(B200='2. Metadata'!N$1,'2. Metadata'!N$5))))))))))))))","v":49.97944},{"$f":"IF(ISBLANK(B200)=TRUE,\" \", IF(B200='2. Metadata'!B$1,'2. Metadata'!B$6, IF(B200='2. Metadata'!C$1,'2. Metadata'!C$6,IF(B200='2. Metadata'!D$1,'2. Metadata'!D$6, IF(B200='2. Metadata'!E$1,'2. Metadata'!E$6,IF( B200='2. Metadata'!F$1,'2. Metadata'!F$6,IF(B200='2. Metadata'!G$1,'2. Metadata'!G$6,IF(B200='2. Metadata'!H$1,'2. Metadata'!H$6, IF(B200='2. Metadata'!I$1,'2. Metadata'!I$6, IF(B200='2. Metadata'!J$1,'2. Metadata'!J$6, IF(B200='2. Metadata'!K$1,'2. Metadata'!K$6, IF(B200='2. Metadata'!L$1,'2. Metadata'!L$6, IF(B200='2. Metadata'!M$1,'2. Metadata'!M$6, IF(B200='2. Metadata'!N$1,'2. Metadata'!N$6))))))))))))))","v":-117.88417},"n/a",1.398,{"$f":"IF(ISBLANK(F200)=TRUE,\" \",'2. Metadata'!B$14)","v":"degrees Celsius"},0.825,{"$f":"IF(ISBLANK(H200)=TRUE,\" \",'2. Metadata'!B$26)","v":"degrees Celsius"},1.038,{"$f":"IF(ISBLANK(J200)=TRUE,\" \",'2. Metadata'!B$38)","v":"degrees Celsius"},"n/a"]
["2014-02-19","NECAR01",{"$f":"IF(ISBLANK(B201)=TRUE,\" \", IF(B201='2. Metadata'!B$1,'2. Metadata'!B$5, IF(B201='2. Metadata'!C$1,'2. Metadata'!C$5,IF(B201='2. Metadata'!D$1,'2. Metadata'!D$5, IF(B201='2. Metadata'!E$1,'2. Metadata'!E$5,IF( B201='2. Metadata'!F$1,'2. Metadata'!F$5,IF(B201='2. Metadata'!G$1,'2. Metadata'!G$5,IF(B201='2. Metadata'!H$1,'2. Metadata'!H$5, IF(B201='2. Metadata'!I$1,'2. Metadata'!I$5, IF(B201='2. Metadata'!J$1,'2. Metadata'!J$5, IF(B201='2. Metadata'!K$1,'2. Metadata'!K$5, IF(B201='2. Metadata'!L$1,'2. Metadata'!L$5, IF(B201='2. Metadata'!M$1,'2. Metadata'!M$5, IF(B201='2. Metadata'!N$1,'2. Metadata'!N$5))))))))))))))","v":49.97944},{"$f":"IF(ISBLANK(B201)=TRUE,\" \", IF(B201='2. Metadata'!B$1,'2. Metadata'!B$6, IF(B201='2. Metadata'!C$1,'2. Metadata'!C$6,IF(B201='2. Metadata'!D$1,'2. Metadata'!D$6, IF(B201='2. Metadata'!E$1,'2. Metadata'!E$6,IF( B201='2. Metadata'!F$1,'2. Metadata'!F$6,IF(B201='2. Metadata'!G$1,'2. Metadata'!G$6,IF(B201='2. Metadata'!H$1,'2. Metadata'!H$6, IF(B201='2. Metadata'!I$1,'2. Metadata'!I$6, IF(B201='2. Metadata'!J$1,'2. Metadata'!J$6, IF(B201='2. Metadata'!K$1,'2. Metadata'!K$6, IF(B201='2. Metadata'!L$1,'2. Metadata'!L$6, IF(B201='2. Metadata'!M$1,'2. Metadata'!M$6, IF(B201='2. Metadata'!N$1,'2. Metadata'!N$6))))))))))))))","v":-117.88417},"n/a",1.751,{"$f":"IF(ISBLANK(F201)=TRUE,\" \",'2. Metadata'!B$14)","v":"degrees Celsius"},0.825,{"$f":"IF(ISBLANK(H201)=TRUE,\" \",'2. Metadata'!B$26)","v":"degrees Celsius"},1.174,{"$f":"IF(ISBLANK(J201)=TRUE,\" \",'2. Metadata'!B$38)","v":"degrees Celsius"},"n/a"]
["2014-02-20","NECAR01",{"$f":"IF(ISBLANK(B202)=TRUE,\" \", IF(B202='2. Metadata'!B$1,'2. Metadata'!B$5, IF(B202='2. Metadata'!C$1,'2. Metadata'!C$5,IF(B202='2. Metadata'!D$1,'2. Metadata'!D$5, IF(B202='2. Metadata'!E$1,'2. Metadata'!E$5,IF( B202='2. Metadata'!F$1,'2. Metadata'!F$5,IF(B202='2. Metadata'!G$1,'2. Metadata'!G$5,IF(B202='2. Metadata'!H$1,'2. Metadata'!H$5, IF(B202='2. Metadata'!I$1,'2. Metadata'!I$5, IF(B202='2. Metadata'!J$1,'2. Metadata'!J$5, IF(B202='2. Metadata'!K$1,'2. Metadata'!K$5, IF(B202='2. Metadata'!L$1,'2. Metadata'!L$5, IF(B202='2. Metadata'!M$1,'2. Metadata'!M$5, IF(B202='2. Metadata'!N$1,'2. Metadata'!N$5))))))))))))))","v":49.97944},{"$f":"IF(ISBLANK(B202)=TRUE,\" \", IF(B202='2. Metadata'!B$1,'2. Metadata'!B$6, IF(B202='2. Metadata'!C$1,'2. Metadata'!C$6,IF(B202='2. Metadata'!D$1,'2. Metadata'!D$6, IF(B202='2. Metadata'!E$1,'2. Metadata'!E$6,IF( B202='2. Metadata'!F$1,'2. Metadata'!F$6,IF(B202='2. Metadata'!G$1,'2. Metadata'!G$6,IF(B202='2. Metadata'!H$1,'2. Metadata'!H$6, IF(B202='2. Metadata'!I$1,'2. Metadata'!I$6, IF(B202='2. Metadata'!J$1,'2. Metadata'!J$6, IF(B202='2. Metadata'!K$1,'2. Metadata'!K$6, IF(B202='2. Metadata'!L$1,'2. Metadata'!L$6, IF(B202='2. Metadata'!M$1,'2. Metadata'!M$6, IF(B202='2. Metadata'!N$1,'2. Metadata'!N$6))))))))))))))","v":-117.88417},"n/a",1.344,{"$f":"IF(ISBLANK(F202)=TRUE,\" \",'2. Metadata'!B$14)","v":"degrees Celsius"},0.715,{"$f":"IF(ISBLANK(H202)=TRUE,\" \",'2. Metadata'!B$26)","v":"degrees Celsius"},0.977,{"$f":"IF(ISBLANK(J202)=TRUE,\" \",'2. Metadata'!B$38)","v":"degrees Celsius"},"n/a"]
["2014-02-21","NECAR01",{"$f":"IF(ISBLANK(B203)=TRUE,\" \", IF(B203='2. Metadata'!B$1,'2. Metadata'!B$5, IF(B203='2. Metadata'!C$1,'2. Metadata'!C$5,IF(B203='2. Metadata'!D$1,'2. Metadata'!D$5, IF(B203='2. Metadata'!E$1,'2. Metadata'!E$5,IF( B203='2. Metadata'!F$1,'2. Metadata'!F$5,IF(B203='2. Metadata'!G$1,'2. Metadata'!G$5,IF(B203='2. Metadata'!H$1,'2. Metadata'!H$5, IF(B203='2. Metadata'!I$1,'2. Metadata'!I$5, IF(B203='2. Metadata'!J$1,'2. Metadata'!J$5, IF(B203='2. Metadata'!K$1,'2. Metadata'!K$5, IF(B203='2. Metadata'!L$1,'2. Metadata'!L$5, IF(B203='2. Metadata'!M$1,'2. Metadata'!M$5, IF(B203='2. Metadata'!N$1,'2. Metadata'!N$5))))))))))))))","v":49.97944},{"$f":"IF(ISBLANK(B203)=TRUE,\" \", IF(B203='2. Metadata'!B$1,'2. Metadata'!B$6, IF(B203='2. Metadata'!C$1,'2. Metadata'!C$6,IF(B203='2. Metadata'!D$1,'2. Metadata'!D$6, IF(B203='2. Metadata'!E$1,'2. Metadata'!E$6,IF( B203='2. Metadata'!F$1,'2. Metadata'!F$6,IF(B203='2. Metadata'!G$1,'2. Metadata'!G$6,IF(B203='2. Metadata'!H$1,'2. Metadata'!H$6, IF(B203='2. Metadata'!I$1,'2. Metadata'!I$6, IF(B203='2. Metadata'!J$1,'2. Metadata'!J$6, IF(B203='2. Metadata'!K$1,'2. Metadata'!K$6, IF(B203='2. Metadata'!L$1,'2. Metadata'!L$6, IF(B203='2. Metadata'!M$1,'2. Metadata'!M$6, IF(B203='2. Metadata'!N$1,'2. Metadata'!N$6))))))))))))))","v":-117.88417},"n/a",1.48,{"$f":"IF(ISBLANK(F203)=TRUE,\" \",'2. Metadata'!B$14)","v":"degrees Celsius"},0.439,{"$f":"IF(ISBLANK(H203)=TRUE,\" \",'2. Metadata'!B$26)","v":"degrees Celsius"},0.929,{"$f":"IF(ISBLANK(J203)=TRUE,\" \",'2. Metadata'!B$38)","v":"degrees Celsius"},"n/a"]
["2014-02-22","NECAR01",{"$f":"IF(ISBLANK(B204)=TRUE,\" \", IF(B204='2. Metadata'!B$1,'2. Metadata'!B$5, IF(B204='2. Metadata'!C$1,'2. Metadata'!C$5,IF(B204='2. Metadata'!D$1,'2. Metadata'!D$5, IF(B204='2. Metadata'!E$1,'2. Metadata'!E$5,IF( B204='2. Metadata'!F$1,'2. Metadata'!F$5,IF(B204='2. Metadata'!G$1,'2. Metadata'!G$5,IF(B204='2. Metadata'!H$1,'2. Metadata'!H$5, IF(B204='2. Metadata'!I$1,'2. Metadata'!I$5, IF(B204='2. Metadata'!J$1,'2. Metadata'!J$5, IF(B204='2. Metadata'!K$1,'2. Metadata'!K$5, IF(B204='2. Metadata'!L$1,'2. Metadata'!L$5, IF(B204='2. Metadata'!M$1,'2. Metadata'!M$5, IF(B204='2. Metadata'!N$1,'2. Metadata'!N$5))))))))))))))","v":49.97944},{"$f":"IF(ISBLANK(B204)=TRUE,\" \", IF(B204='2. Metadata'!B$1,'2. Metadata'!B$6, IF(B204='2. Metadata'!C$1,'2. Metadata'!C$6,IF(B204='2. Metadata'!D$1,'2. Metadata'!D$6, IF(B204='2. Metadata'!E$1,'2. Metadata'!E$6,IF( B204='2. Metadata'!F$1,'2. Metadata'!F$6,IF(B204='2. Metadata'!G$1,'2. Metadata'!G$6,IF(B204='2. Metadata'!H$1,'2. Metadata'!H$6, IF(B204='2. Metadata'!I$1,'2. Metadata'!I$6, IF(B204='2. Metadata'!J$1,'2. Metadata'!J$6, IF(B204='2. Metadata'!K$1,'2. Metadata'!K$6, IF(B204='2. Metadata'!L$1,'2. Metadata'!L$6, IF(B204='2. Metadata'!M$1,'2. Metadata'!M$6, IF(B204='2. Metadata'!N$1,'2. Metadata'!N$6))))))))))))))","v":-117.88417},"n/a",0.962,{"$f":"IF(ISBLANK(F204)=TRUE,\" \",'2. Metadata'!B$14)","v":"degrees Celsius"},-0.06,{"$f":"IF(ISBLANK(H204)=TRUE,\" \",'2. Metadata'!B$26)","v":"degrees Celsius"},0.355,{"$f":"IF(ISBLANK(J204)=TRUE,\" \",'2. Metadata'!B$38)","v":"degrees Celsius"},"n/a"]
["2014-02-23","NECAR01",{"$f":"IF(ISBLANK(B205)=TRUE,\" \", IF(B205='2. Metadata'!B$1,'2. Metadata'!B$5, IF(B205='2. Metadata'!C$1,'2. Metadata'!C$5,IF(B205='2. Metadata'!D$1,'2. Metadata'!D$5, IF(B205='2. Metadata'!E$1,'2. Metadata'!E$5,IF( B205='2. Metadata'!F$1,'2. Metadata'!F$5,IF(B205='2. Metadata'!G$1,'2. Metadata'!G$5,IF(B205='2. Metadata'!H$1,'2. Metadata'!H$5, IF(B205='2. Metadata'!I$1,'2. Metadata'!I$5, IF(B205='2. Metadata'!J$1,'2. Metadata'!J$5, IF(B205='2. Metadata'!K$1,'2. Metadata'!K$5, IF(B205='2. Metadata'!L$1,'2. Metadata'!L$5, IF(B205='2. Metadata'!M$1,'2. Metadata'!M$5, IF(B205='2. Metadata'!N$1,'2. Metadata'!N$5))))))))))))))","v":49.97944},{"$f":"IF(ISBLANK(B205)=TRUE,\" \", IF(B205='2. Metadata'!B$1,'2. Metadata'!B$6, IF(B205='2. Metadata'!C$1,'2. Metadata'!C$6,IF(B205='2. Metadata'!D$1,'2. Metadata'!D$6, IF(B205='2. Metadata'!E$1,'2. Metadata'!E$6,IF( B205='2. Metadata'!F$1,'2. Metadata'!F$6,IF(B205='2. Metadata'!G$1,'2. Metadata'!G$6,IF(B205='2. Metadata'!H$1,'2. Metadata'!H$6, IF(B205='2. Metadata'!I$1,'2. Metadata'!I$6, IF(B205='2. Metadata'!J$1,'2. Metadata'!J$6, IF(B205='2. Metadata'!K$1,'2. Metadata'!K$6, IF(B205='2. Metadata'!L$1,'2. Metadata'!L$6, IF(B205='2. Metadata'!M$1,'2. Metadata'!M$6, IF(B205='2. Metadata'!N$1,'2. Metadata'!N$6))))))))))))))","v":-117.88417},"n/a",1.017,{"$f":"IF(ISBLANK(F205)=TRUE,\" \",'2. Metadata'!B$14)","v":"degrees Celsius"},0.246,{"$f":"IF(ISBLANK(H205)=TRUE,\" \",'2. Metadata'!B$26)","v":"degrees Celsius"},0.504,{"$f":"IF(ISBLANK(J205)=TRUE,\" \",'2. Metadata'!B$38)","v":"degrees Celsius"},"n/a"]
["2014-02-24","NECAR01",{"$f":"IF(ISBLANK(B206)=TRUE,\" \", IF(B206='2. Metadata'!B$1,'2. Metadata'!B$5, IF(B206='2. Metadata'!C$1,'2. Metadata'!C$5,IF(B206='2. Metadata'!D$1,'2. Metadata'!D$5, IF(B206='2. Metadata'!E$1,'2. Metadata'!E$5,IF( B206='2. Metadata'!F$1,'2. Metadata'!F$5,IF(B206='2. Metadata'!G$1,'2. Metadata'!G$5,IF(B206='2. Metadata'!H$1,'2. Metadata'!H$5, IF(B206='2. Metadata'!I$1,'2. Metadata'!I$5, IF(B206='2. Metadata'!J$1,'2. Metadata'!J$5, IF(B206='2. Metadata'!K$1,'2. Metadata'!K$5, IF(B206='2. Metadata'!L$1,'2. Metadata'!L$5, IF(B206='2. Metadata'!M$1,'2. Metadata'!M$5, IF(B206='2. Metadata'!N$1,'2. Metadata'!N$5))))))))))))))","v":49.97944},{"$f":"IF(ISBLANK(B206)=TRUE,\" \", IF(B206='2. Metadata'!B$1,'2. Metadata'!B$6, IF(B206='2. Metadata'!C$1,'2. Metadata'!C$6,IF(B206='2. Metadata'!D$1,'2. Metadata'!D$6, IF(B206='2. Metadata'!E$1,'2. Metadata'!E$6,IF( B206='2. Metadata'!F$1,'2. Metadata'!F$6,IF(B206='2. Metadata'!G$1,'2. Metadata'!G$6,IF(B206='2. Metadata'!H$1,'2. Metadata'!H$6, IF(B206='2. Metadata'!I$1,'2. Metadata'!I$6, IF(B206='2. Metadata'!J$1,'2. Metadata'!J$6, IF(B206='2. Metadata'!K$1,'2. Metadata'!K$6, IF(B206='2. Metadata'!L$1,'2. Metadata'!L$6, IF(B206='2. Metadata'!M$1,'2. Metadata'!M$6, IF(B206='2. Metadata'!N$1,'2. Metadata'!N$6))))))))))))))","v":-117.88417},"n/a",0.522,{"$f":"IF(ISBLANK(F206)=TRUE,\" \",'2. Metadata'!B$14)","v":"degrees Celsius"},-0.06,{"$f":"IF(ISBLANK(H206)=TRUE,\" \",'2. Metadata'!B$26)","v":"degrees Celsius"},0.1,{"$f":"IF(ISBLANK(J206)=TRUE,\" \",'2. Metadata'!B$38)","v":"degrees Celsius"},"n/a"]
["2014-02-25","NECAR01",{"$f":"IF(ISBLANK(B207)=TRUE,\" \", IF(B207='2. Metadata'!B$1,'2. Metadata'!B$5, IF(B207='2. Metadata'!C$1,'2. Metadata'!C$5,IF(B207='2. Metadata'!D$1,'2. Metadata'!D$5, IF(B207='2. Metadata'!E$1,'2. Metadata'!E$5,IF( B207='2. Metadata'!F$1,'2. Metadata'!F$5,IF(B207='2. Metadata'!G$1,'2. Metadata'!G$5,IF(B207='2. Metadata'!H$1,'2. Metadata'!H$5, IF(B207='2. Metadata'!I$1,'2. Metadata'!I$5, IF(B207='2. Metadata'!J$1,'2. Metadata'!J$5, IF(B207='2. Metadata'!K$1,'2. Metadata'!K$5, IF(B207='2. Metadata'!L$1,'2. Metadata'!L$5, IF(B207='2. Metadata'!M$1,'2. Metadata'!M$5, IF(B207='2. Metadata'!N$1,'2. Metadata'!N$5))))))))))))))","v":49.97944},{"$f":"IF(ISBLANK(B207)=TRUE,\" \", IF(B207='2. Metadata'!B$1,'2. Metadata'!B$6, IF(B207='2. Metadata'!C$1,'2. Metadata'!C$6,IF(B207='2. Metadata'!D$1,'2. Metadata'!D$6, IF(B207='2. Metadata'!E$1,'2. Metadata'!E$6,IF( B207='2. Metadata'!F$1,'2. Metadata'!F$6,IF(B207='2. Metadata'!G$1,'2. Metadata'!G$6,IF(B207='2. Metadata'!H$1,'2. Metadata'!H$6, IF(B207='2. Metadata'!I$1,'2. Metadata'!I$6, IF(B207='2. Metadata'!J$1,'2. Metadata'!J$6, IF(B207='2. Metadata'!K$1,'2. Metadata'!K$6, IF(B207='2. Metadata'!L$1,'2. Metadata'!L$6, IF(B207='2. Metadata'!M$1,'2. Metadata'!M$6, IF(B207='2. Metadata'!N$1,'2. Metadata'!N$6))))))))))))))","v":-117.88417},"n/a",0.024,{"$f":"IF(ISBLANK(F207)=TRUE,\" \",'2. Metadata'!B$14)","v":"degrees Celsius"},-0.032,{"$f":"IF(ISBLANK(H207)=TRUE,\" \",'2. Metadata'!B$26)","v":"degrees Celsius"},-0.014,{"$f":"IF(ISBLANK(J207)=TRUE,\" \",'2. Metadata'!B$38)","v":"degrees Celsius"},"n/a"]
["2014-02-26","NECAR01",{"$f":"IF(ISBLANK(B208)=TRUE,\" \", IF(B208='2. Metadata'!B$1,'2. Metadata'!B$5, IF(B208='2. Metadata'!C$1,'2. Metadata'!C$5,IF(B208='2. Metadata'!D$1,'2. Metadata'!D$5, IF(B208='2. Metadata'!E$1,'2. Metadata'!E$5,IF( B208='2. Metadata'!F$1,'2. Metadata'!F$5,IF(B208='2. Metadata'!G$1,'2. Metadata'!G$5,IF(B208='2. Metadata'!H$1,'2. Metadata'!H$5, IF(B208='2. Metadata'!I$1,'2. Metadata'!I$5, IF(B208='2. Metadata'!J$1,'2. Metadata'!J$5, IF(B208='2. Metadata'!K$1,'2. Metadata'!K$5, IF(B208='2. Metadata'!L$1,'2. Metadata'!L$5, IF(B208='2. Metadata'!M$1,'2. Metadata'!M$5, IF(B208='2. Metadata'!N$1,'2. Metadata'!N$5))))))))))))))","v":49.97944},{"$f":"IF(ISBLANK(B208)=TRUE,\" \", IF(B208='2. Metadata'!B$1,'2. Metadata'!B$6, IF(B208='2. Metadata'!C$1,'2. Metadata'!C$6,IF(B208='2. Metadata'!D$1,'2. Metadata'!D$6, IF(B208='2. Metadata'!E$1,'2. Metadata'!E$6,IF( B208='2. Metadata'!F$1,'2. Metadata'!F$6,IF(B208='2. Metadata'!G$1,'2. Metadata'!G$6,IF(B208='2. Metadata'!H$1,'2. Metadata'!H$6, IF(B208='2. Metadata'!I$1,'2. Metadata'!I$6, IF(B208='2. Metadata'!J$1,'2. Metadata'!J$6, IF(B208='2. Metadata'!K$1,'2. Metadata'!K$6, IF(B208='2. Metadata'!L$1,'2. Metadata'!L$6, IF(B208='2. Metadata'!M$1,'2. Metadata'!M$6, IF(B208='2. Metadata'!N$1,'2. Metadata'!N$6))))))))))))))","v":-117.88417},"n/a",-0.004,{"$f":"IF(ISBLANK(F208)=TRUE,\" \",'2. Metadata'!B$14)","v":"degrees Celsius"},-0.032,{"$f":"IF(ISBLANK(H208)=TRUE,\" \",'2. Metadata'!B$26)","v":"degrees Celsius"},-0.018,{"$f":"IF(ISBLANK(J208)=TRUE,\" \",'2. Metadata'!B$38)","v":"degrees Celsius"},"n/a"]
["2014-02-27","NECAR01",{"$f":"IF(ISBLANK(B209)=TRUE,\" \", IF(B209='2. Metadata'!B$1,'2. Metadata'!B$5, IF(B209='2. Metadata'!C$1,'2. Metadata'!C$5,IF(B209='2. Metadata'!D$1,'2. Metadata'!D$5, IF(B209='2. Metadata'!E$1,'2. Metadata'!E$5,IF( B209='2. Metadata'!F$1,'2. Metadata'!F$5,IF(B209='2. Metadata'!G$1,'2. Metadata'!G$5,IF(B209='2. Metadata'!H$1,'2. Metadata'!H$5, IF(B209='2. Metadata'!I$1,'2. Metadata'!I$5, IF(B209='2. Metadata'!J$1,'2. Metadata'!J$5, IF(B209='2. Metadata'!K$1,'2. Metadata'!K$5, IF(B209='2. Metadata'!L$1,'2. Metadata'!L$5, IF(B209='2. Metadata'!M$1,'2. Metadata'!M$5, IF(B209='2. Metadata'!N$1,'2. Metadata'!N$5))))))))))))))","v":49.97944},{"$f":"IF(ISBLANK(B209)=TRUE,\" \", IF(B209='2. Metadata'!B$1,'2. Metadata'!B$6, IF(B209='2. Metadata'!C$1,'2. Metadata'!C$6,IF(B209='2. Metadata'!D$1,'2. Metadata'!D$6, IF(B209='2. Metadata'!E$1,'2. Metadata'!E$6,IF( B209='2. Metadata'!F$1,'2. Metadata'!F$6,IF(B209='2. Metadata'!G$1,'2. Metadata'!G$6,IF(B209='2. Metadata'!H$1,'2. Metadata'!H$6, IF(B209='2. Metadata'!I$1,'2. Metadata'!I$6, IF(B209='2. Metadata'!J$1,'2. Metadata'!J$6, IF(B209='2. Metadata'!K$1,'2. Metadata'!K$6, IF(B209='2. Metadata'!L$1,'2. Metadata'!L$6, IF(B209='2. Metadata'!M$1,'2. Metadata'!M$6, IF(B209='2. Metadata'!N$1,'2. Metadata'!N$6))))))))))))))","v":-117.88417},"n/a",-0.004,{"$f":"IF(ISBLANK(F209)=TRUE,\" \",'2. Metadata'!B$14)","v":"degrees Celsius"},-0.032,{"$f":"IF(ISBLANK(H209)=TRUE,\" \",'2. Metadata'!B$26)","v":"degrees Celsius"},-0.01,{"$f":"IF(ISBLANK(J209)=TRUE,\" \",'2. Metadata'!B$38)","v":"degrees Celsius"},"n/a"]
["2014-02-28","NECAR01",{"$f":"IF(ISBLANK(B210)=TRUE,\" \", IF(B210='2. Metadata'!B$1,'2. Metadata'!B$5, IF(B210='2. Metadata'!C$1,'2. Metadata'!C$5,IF(B210='2. Metadata'!D$1,'2. Metadata'!D$5, IF(B210='2. Metadata'!E$1,'2. Metadata'!E$5,IF( B210='2. Metadata'!F$1,'2. Metadata'!F$5,IF(B210='2. Metadata'!G$1,'2. Metadata'!G$5,IF(B210='2. Metadata'!H$1,'2. Metadata'!H$5, IF(B210='2. Metadata'!I$1,'2. Metadata'!I$5, IF(B210='2. Metadata'!J$1,'2. Metadata'!J$5, IF(B210='2. Metadata'!K$1,'2. Metadata'!K$5, IF(B210='2. Metadata'!L$1,'2. Metadata'!L$5, IF(B210='2. Metadata'!M$1,'2. Metadata'!M$5, IF(B210='2. Metadata'!N$1,'2. Metadata'!N$5))))))))))))))","v":49.97944},{"$f":"IF(ISBLANK(B210)=TRUE,\" \", IF(B210='2. Metadata'!B$1,'2. Metadata'!B$6, IF(B210='2. Metadata'!C$1,'2. Metadata'!C$6,IF(B210='2. Metadata'!D$1,'2. Metadata'!D$6, IF(B210='2. Metadata'!E$1,'2. Metadata'!E$6,IF( B210='2. Metadata'!F$1,'2. Metadata'!F$6,IF(B210='2. Metadata'!G$1,'2. Metadata'!G$6,IF(B210='2. Metadata'!H$1,'2. Metadata'!H$6, IF(B210='2. Metadata'!I$1,'2. Metadata'!I$6, IF(B210='2. Metadata'!J$1,'2. Metadata'!J$6, IF(B210='2. Metadata'!K$1,'2. Metadata'!K$6, IF(B210='2. Metadata'!L$1,'2. Metadata'!L$6, IF(B210='2. Metadata'!M$1,'2. Metadata'!M$6, IF(B210='2. Metadata'!N$1,'2. Metadata'!N$6))))))))))))))","v":-117.88417},"n/a",1.235,{"$f":"IF(ISBLANK(F210)=TRUE,\" \",'2. Metadata'!B$14)","v":"degrees Celsius"},-0.004,{"$f":"IF(ISBLANK(H210)=TRUE,\" \",'2. Metadata'!B$26)","v":"degrees Celsius"},0.455,{"$f":"IF(ISBLANK(J210)=TRUE,\" \",'2. Metadata'!B$38)","v":"degrees Celsius"},"n/a"]
["2014-03-01","NECAR01",{"$f":"IF(ISBLANK(B211)=TRUE,\" \", IF(B211='2. Metadata'!B$1,'2. Metadata'!B$5, IF(B211='2. Metadata'!C$1,'2. Metadata'!C$5,IF(B211='2. Metadata'!D$1,'2. Metadata'!D$5, IF(B211='2. Metadata'!E$1,'2. Metadata'!E$5,IF( B211='2. Metadata'!F$1,'2. Metadata'!F$5,IF(B211='2. Metadata'!G$1,'2. Metadata'!G$5,IF(B211='2. Metadata'!H$1,'2. Metadata'!H$5, IF(B211='2. Metadata'!I$1,'2. Metadata'!I$5, IF(B211='2. Metadata'!J$1,'2. Metadata'!J$5, IF(B211='2. Metadata'!K$1,'2. Metadata'!K$5, IF(B211='2. Metadata'!L$1,'2. Metadata'!L$5, IF(B211='2. Metadata'!M$1,'2. Metadata'!M$5, IF(B211='2. Metadata'!N$1,'2. Metadata'!N$5))))))))))))))","v":49.97944},{"$f":"IF(ISBLANK(B211)=TRUE,\" \", IF(B211='2. Metadata'!B$1,'2. Metadata'!B$6, IF(B211='2. Metadata'!C$1,'2. Metadata'!C$6,IF(B211='2. Metadata'!D$1,'2. Metadata'!D$6, IF(B211='2. Metadata'!E$1,'2. Metadata'!E$6,IF( B211='2. Metadata'!F$1,'2. Metadata'!F$6,IF(B211='2. Metadata'!G$1,'2. Metadata'!G$6,IF(B211='2. Metadata'!H$1,'2. Metadata'!H$6, IF(B211='2. Metadata'!I$1,'2. Metadata'!I$6, IF(B211='2. Metadata'!J$1,'2. Metadata'!J$6, IF(B211='2. Metadata'!K$1,'2. Metadata'!K$6, IF(B211='2. Metadata'!L$1,'2. Metadata'!L$6, IF(B211='2. Metadata'!M$1,'2. Metadata'!M$6, IF(B211='2. Metadata'!N$1,'2. Metadata'!N$6))))))))))))))","v":-117.88417},"n/a",0.77,{"$f":"IF(ISBLANK(F211)=TRUE,\" \",'2. Metadata'!B$14)","v":"degrees Celsius"},-0.032,{"$f":"IF(ISBLANK(H211)=TRUE,\" \",'2. Metadata'!B$26)","v":"degrees Celsius"},0.354,{"$f":"IF(ISBLANK(J211)=TRUE,\" \",'2. Metadata'!B$38)","v":"degrees Celsius"},"n/a"]
["2014-03-02","NECAR01",{"$f":"IF(ISBLANK(B212)=TRUE,\" \", IF(B212='2. Metadata'!B$1,'2. Metadata'!B$5, IF(B212='2. Metadata'!C$1,'2. Metadata'!C$5,IF(B212='2. Metadata'!D$1,'2. Metadata'!D$5, IF(B212='2. Metadata'!E$1,'2. Metadata'!E$5,IF( B212='2. Metadata'!F$1,'2. Metadata'!F$5,IF(B212='2. Metadata'!G$1,'2. Metadata'!G$5,IF(B212='2. Metadata'!H$1,'2. Metadata'!H$5, IF(B212='2. Metadata'!I$1,'2. Metadata'!I$5, IF(B212='2. Metadata'!J$1,'2. Metadata'!J$5, IF(B212='2. Metadata'!K$1,'2. Metadata'!K$5, IF(B212='2. Metadata'!L$1,'2. Metadata'!L$5, IF(B212='2. Metadata'!M$1,'2. Metadata'!M$5, IF(B212='2. Metadata'!N$1,'2. Metadata'!N$5))))))))))))))","v":49.97944},{"$f":"IF(ISBLANK(B212)=TRUE,\" \", IF(B212='2. Metadata'!B$1,'2. Metadata'!B$6, IF(B212='2. Metadata'!C$1,'2. Metadata'!C$6,IF(B212='2. Metadata'!D$1,'2. Metadata'!D$6, IF(B212='2. Metadata'!E$1,'2. Metadata'!E$6,IF( B212='2. Metadata'!F$1,'2. Metadata'!F$6,IF(B212='2. Metadata'!G$1,'2. Metadata'!G$6,IF(B212='2. Metadata'!H$1,'2. Metadata'!H$6, IF(B212='2. Metadata'!I$1,'2. Metadata'!I$6, IF(B212='2. Metadata'!J$1,'2. Metadata'!J$6, IF(B212='2. Metadata'!K$1,'2. Metadata'!K$6, IF(B212='2. Metadata'!L$1,'2. Metadata'!L$6, IF(B212='2. Metadata'!M$1,'2. Metadata'!M$6, IF(B212='2. Metadata'!N$1,'2. Metadata'!N$6))))))))))))))","v":-117.88417},"n/a",-0.004,{"$f":"IF(ISBLANK(F212)=TRUE,\" \",'2. Metadata'!B$14)","v":"degrees Celsius"},-0.032,{"$f":"IF(ISBLANK(H212)=TRUE,\" \",'2. Metadata'!B$26)","v":"degrees Celsius"},-0.018,{"$f":"IF(ISBLANK(J212)=TRUE,\" \",'2. Metadata'!B$38)","v":"degrees Celsius"},"n/a"]
["2014-03-03","NECAR01",{"$f":"IF(ISBLANK(B213)=TRUE,\" \", IF(B213='2. Metadata'!B$1,'2. Metadata'!B$5, IF(B213='2. Metadata'!C$1,'2. Metadata'!C$5,IF(B213='2. Metadata'!D$1,'2. Metadata'!D$5, IF(B213='2. Metadata'!E$1,'2. Metadata'!E$5,IF( B213='2. Metadata'!F$1,'2. Metadata'!F$5,IF(B213='2. Metadata'!G$1,'2. Metadata'!G$5,IF(B213='2. Metadata'!H$1,'2. Metadata'!H$5, IF(B213='2. Metadata'!I$1,'2. Metadata'!I$5, IF(B213='2. Metadata'!J$1,'2. Metadata'!J$5, IF(B213='2. Metadata'!K$1,'2. Metadata'!K$5, IF(B213='2. Metadata'!L$1,'2. Metadata'!L$5, IF(B213='2. Metadata'!M$1,'2. Metadata'!M$5, IF(B213='2. Metadata'!N$1,'2. Metadata'!N$5))))))))))))))","v":49.97944},{"$f":"IF(ISBLANK(B213)=TRUE,\" \", IF(B213='2. Metadata'!B$1,'2. Metadata'!B$6, IF(B213='2. Metadata'!C$1,'2. Metadata'!C$6,IF(B213='2. Metadata'!D$1,'2. Metadata'!D$6, IF(B213='2. Metadata'!E$1,'2. Metadata'!E$6,IF( B213='2. Metadata'!F$1,'2. Metadata'!F$6,IF(B213='2. Metadata'!G$1,'2. Metadata'!G$6,IF(B213='2. Metadata'!H$1,'2. Metadata'!H$6, IF(B213='2. Metadata'!I$1,'2. Metadata'!I$6, IF(B213='2. Metadata'!J$1,'2. Metadata'!J$6, IF(B213='2. Metadata'!K$1,'2. Metadata'!K$6, IF(B213='2. Metadata'!L$1,'2. Metadata'!L$6, IF(B213='2. Metadata'!M$1,'2. Metadata'!M$6, IF(B213='2. Metadata'!N$1,'2. Metadata'!N$6))))))))))))))","v":-117.88417},"n/a",-0.004,{"$f":"IF(ISBLANK(F213)=TRUE,\" \",'2. Metadata'!B$14)","v":"degrees Celsius"},-0.032,{"$f":"IF(ISBLANK(H213)=TRUE,\" \",'2. Metadata'!B$26)","v":"degrees Celsius"},-0.018,{"$f":"IF(ISBLANK(J213)=TRUE,\" \",'2. Metadata'!B$38)","v":"degrees Celsius"},"n/a"]
["2014-03-04","NECAR01",{"$f":"IF(ISBLANK(B214)=TRUE,\" \", IF(B214='2. Metadata'!B$1,'2. Metadata'!B$5, IF(B214='2. Metadata'!C$1,'2. Metadata'!C$5,IF(B214='2. Metadata'!D$1,'2. Metadata'!D$5, IF(B214='2. Metadata'!E$1,'2. Metadata'!E$5,IF( B214='2. Metadata'!F$1,'2. Metadata'!F$5,IF(B214='2. Metadata'!G$1,'2. Metadata'!G$5,IF(B214='2. Metadata'!H$1,'2. Metadata'!H$5, IF(B214='2. Metadata'!I$1,'2. Metadata'!I$5, IF(B214='2. Metadata'!J$1,'2. Metadata'!J$5, IF(B214='2. Metadata'!K$1,'2. Metadata'!K$5, IF(B214='2. Metadata'!L$1,'2. Metadata'!L$5, IF(B214='2. Metadata'!M$1,'2. Metadata'!M$5, IF(B214='2. Metadata'!N$1,'2. Metadata'!N$5))))))))))))))","v":49.97944},{"$f":"IF(ISBLANK(B214)=TRUE,\" \", IF(B214='2. Metadata'!B$1,'2. Metadata'!B$6, IF(B214='2. Metadata'!C$1,'2. Metadata'!C$6,IF(B214='2. Metadata'!D$1,'2. Metadata'!D$6, IF(B214='2. Metadata'!E$1,'2. Metadata'!E$6,IF( B214='2. Metadata'!F$1,'2. Metadata'!F$6,IF(B214='2. Metadata'!G$1,'2. Metadata'!G$6,IF(B214='2. Metadata'!H$1,'2. Metadata'!H$6, IF(B214='2. Metadata'!I$1,'2. Metadata'!I$6, IF(B214='2. Metadata'!J$1,'2. Metadata'!J$6, IF(B214='2. Metadata'!K$1,'2. Metadata'!K$6, IF(B214='2. Metadata'!L$1,'2. Metadata'!L$6, IF(B214='2. Metadata'!M$1,'2. Metadata'!M$6, IF(B214='2. Metadata'!N$1,'2. Metadata'!N$6))))))))))))))","v":-117.88417},"n/a",1.099,{"$f":"IF(ISBLANK(F214)=TRUE,\" \",'2. Metadata'!B$14)","v":"degrees Celsius"},-0.032,{"$f":"IF(ISBLANK(H214)=TRUE,\" \",'2. Metadata'!B$26)","v":"degrees Celsius"},0.522,{"$f":"IF(ISBLANK(J214)=TRUE,\" \",'2. Metadata'!B$38)","v":"degrees Celsius"},"n/a"]
["2014-03-05","NECAR01",{"$f":"IF(ISBLANK(B215)=TRUE,\" \", IF(B215='2. Metadata'!B$1,'2. Metadata'!B$5, IF(B215='2. Metadata'!C$1,'2. Metadata'!C$5,IF(B215='2. Metadata'!D$1,'2. Metadata'!D$5, IF(B215='2. Metadata'!E$1,'2. Metadata'!E$5,IF( B215='2. Metadata'!F$1,'2. Metadata'!F$5,IF(B215='2. Metadata'!G$1,'2. Metadata'!G$5,IF(B215='2. Metadata'!H$1,'2. Metadata'!H$5, IF(B215='2. Metadata'!I$1,'2. Metadata'!I$5, IF(B215='2. Metadata'!J$1,'2. Metadata'!J$5, IF(B215='2. Metadata'!K$1,'2. Metadata'!K$5, IF(B215='2. Metadata'!L$1,'2. Metadata'!L$5, IF(B215='2. Metadata'!M$1,'2. Metadata'!M$5, IF(B215='2. Metadata'!N$1,'2. Metadata'!N$5))))))))))))))","v":49.97944},{"$f":"IF(ISBLANK(B215)=TRUE,\" \", IF(B215='2. Metadata'!B$1,'2. Metadata'!B$6, IF(B215='2. Metadata'!C$1,'2. Metadata'!C$6,IF(B215='2. Metadata'!D$1,'2. Metadata'!D$6, IF(B215='2. Metadata'!E$1,'2. Metadata'!E$6,IF( B215='2. Metadata'!F$1,'2. Metadata'!F$6,IF(B215='2. Metadata'!G$1,'2. Metadata'!G$6,IF(B215='2. Metadata'!H$1,'2. Metadata'!H$6, IF(B215='2. Metadata'!I$1,'2. Metadata'!I$6, IF(B215='2. Metadata'!J$1,'2. Metadata'!J$6, IF(B215='2. Metadata'!K$1,'2. Metadata'!K$6, IF(B215='2. Metadata'!L$1,'2. Metadata'!L$6, IF(B215='2. Metadata'!M$1,'2. Metadata'!M$6, IF(B215='2. Metadata'!N$1,'2. Metadata'!N$6))))))))))))))","v":-117.88417},"n/a",1.588,{"$f":"IF(ISBLANK(F215)=TRUE,\" \",'2. Metadata'!B$14)","v":"degrees Celsius"},0.797,{"$f":"IF(ISBLANK(H215)=TRUE,\" \",'2. Metadata'!B$26)","v":"degrees Celsius"},1.076,{"$f":"IF(ISBLANK(J215)=TRUE,\" \",'2. Metadata'!B$38)","v":"degrees Celsius"},"n/a"]
["2014-03-06","NECAR01",{"$f":"IF(ISBLANK(B216)=TRUE,\" \", IF(B216='2. Metadata'!B$1,'2. Metadata'!B$5, IF(B216='2. Metadata'!C$1,'2. Metadata'!C$5,IF(B216='2. Metadata'!D$1,'2. Metadata'!D$5, IF(B216='2. Metadata'!E$1,'2. Metadata'!E$5,IF( B216='2. Metadata'!F$1,'2. Metadata'!F$5,IF(B216='2. Metadata'!G$1,'2. Metadata'!G$5,IF(B216='2. Metadata'!H$1,'2. Metadata'!H$5, IF(B216='2. Metadata'!I$1,'2. Metadata'!I$5, IF(B216='2. Metadata'!J$1,'2. Metadata'!J$5, IF(B216='2. Metadata'!K$1,'2. Metadata'!K$5, IF(B216='2. Metadata'!L$1,'2. Metadata'!L$5, IF(B216='2. Metadata'!M$1,'2. Metadata'!M$5, IF(B216='2. Metadata'!N$1,'2. Metadata'!N$5))))))))))))))","v":49.97944},{"$f":"IF(ISBLANK(B216)=TRUE,\" \", IF(B216='2. Metadata'!B$1,'2. Metadata'!B$6, IF(B216='2. Metadata'!C$1,'2. Metadata'!C$6,IF(B216='2. Metadata'!D$1,'2. Metadata'!D$6, IF(B216='2. Metadata'!E$1,'2. Metadata'!E$6,IF( B216='2. Metadata'!F$1,'2. Metadata'!F$6,IF(B216='2. Metadata'!G$1,'2. Metadata'!G$6,IF(B216='2. Metadata'!H$1,'2. Metadata'!H$6, IF(B216='2. Metadata'!I$1,'2. Metadata'!I$6, IF(B216='2. Metadata'!J$1,'2. Metadata'!J$6, IF(B216='2. Metadata'!K$1,'2. Metadata'!K$6, IF(B216='2. Metadata'!L$1,'2. Metadata'!L$6, IF(B216='2. Metadata'!M$1,'2. Metadata'!M$6, IF(B216='2. Metadata'!N$1,'2. Metadata'!N$6))))))))))))))","v":-117.88417},"n/a",1.67,{"$f":"IF(ISBLANK(F216)=TRUE,\" \",'2. Metadata'!B$14)","v":"degrees Celsius"},0.797,{"$f":"IF(ISBLANK(H216)=TRUE,\" \",'2. Metadata'!B$26)","v":"degrees Celsius"},1.103,{"$f":"IF(ISBLANK(J216)=TRUE,\" \",'2. Metadata'!B$38)","v":"degrees Celsius"},"n/a"]
["2014-03-07","NECAR01",{"$f":"IF(ISBLANK(B217)=TRUE,\" \", IF(B217='2. Metadata'!B$1,'2. Metadata'!B$5, IF(B217='2. Metadata'!C$1,'2. Metadata'!C$5,IF(B217='2. Metadata'!D$1,'2. Metadata'!D$5, IF(B217='2. Metadata'!E$1,'2. Metadata'!E$5,IF( B217='2. Metadata'!F$1,'2. Metadata'!F$5,IF(B217='2. Metadata'!G$1,'2. Metadata'!G$5,IF(B217='2. Metadata'!H$1,'2. Metadata'!H$5, IF(B217='2. Metadata'!I$1,'2. Metadata'!I$5, IF(B217='2. Metadata'!J$1,'2. Metadata'!J$5, IF(B217='2. Metadata'!K$1,'2. Metadata'!K$5, IF(B217='2. Metadata'!L$1,'2. Metadata'!L$5, IF(B217='2. Metadata'!M$1,'2. Metadata'!M$5, IF(B217='2. Metadata'!N$1,'2. Metadata'!N$5))))))))))))))","v":49.97944},{"$f":"IF(ISBLANK(B217)=TRUE,\" \", IF(B217='2. Metadata'!B$1,'2. Metadata'!B$6, IF(B217='2. Metadata'!C$1,'2. Metadata'!C$6,IF(B217='2. Metadata'!D$1,'2. Metadata'!D$6, IF(B217='2. Metadata'!E$1,'2. Metadata'!E$6,IF( B217='2. Metadata'!F$1,'2. Metadata'!F$6,IF(B217='2. Metadata'!G$1,'2. Metadata'!G$6,IF(B217='2. Metadata'!H$1,'2. Metadata'!H$6, IF(B217='2. Metadata'!I$1,'2. Metadata'!I$6, IF(B217='2. Metadata'!J$1,'2. Metadata'!J$6, IF(B217='2. Metadata'!K$1,'2. Metadata'!K$6, IF(B217='2. Metadata'!L$1,'2. Metadata'!L$6, IF(B217='2. Metadata'!M$1,'2. Metadata'!M$6, IF(B217='2. Metadata'!N$1,'2. Metadata'!N$6))))))))))))))","v":-117.88417},"n/a",2.209,{"$f":"IF(ISBLANK(F217)=TRUE,\" \",'2. Metadata'!B$14)","v":"degrees Celsius"},0.495,{"$f":"IF(ISBLANK(H217)=TRUE,\" \",'2. Metadata'!B$26)","v":"degrees Celsius"},1.279,{"$f":"IF(ISBLANK(J217)=TRUE,\" \",'2. Metadata'!B$38)","v":"degrees Celsius"},"n/a"]
["2014-03-08","NECAR01",{"$f":"IF(ISBLANK(B218)=TRUE,\" \", IF(B218='2. Metadata'!B$1,'2. Metadata'!B$5, IF(B218='2. Metadata'!C$1,'2. Metadata'!C$5,IF(B218='2. Metadata'!D$1,'2. Metadata'!D$5, IF(B218='2. Metadata'!E$1,'2. Metadata'!E$5,IF( B218='2. Metadata'!F$1,'2. Metadata'!F$5,IF(B218='2. Metadata'!G$1,'2. Metadata'!G$5,IF(B218='2. Metadata'!H$1,'2. Metadata'!H$5, IF(B218='2. Metadata'!I$1,'2. Metadata'!I$5, IF(B218='2. Metadata'!J$1,'2. Metadata'!J$5, IF(B218='2. Metadata'!K$1,'2. Metadata'!K$5, IF(B218='2. Metadata'!L$1,'2. Metadata'!L$5, IF(B218='2. Metadata'!M$1,'2. Metadata'!M$5, IF(B218='2. Metadata'!N$1,'2. Metadata'!N$5))))))))))))))","v":49.97944},{"$f":"IF(ISBLANK(B218)=TRUE,\" \", IF(B218='2. Metadata'!B$1,'2. Metadata'!B$6, IF(B218='2. Metadata'!C$1,'2. Metadata'!C$6,IF(B218='2. Metadata'!D$1,'2. Metadata'!D$6, IF(B218='2. Metadata'!E$1,'2. Metadata'!E$6,IF( B218='2. Metadata'!F$1,'2. Metadata'!F$6,IF(B218='2. Metadata'!G$1,'2. Metadata'!G$6,IF(B218='2. Metadata'!H$1,'2. Metadata'!H$6, IF(B218='2. Metadata'!I$1,'2. Metadata'!I$6, IF(B218='2. Metadata'!J$1,'2. Metadata'!J$6, IF(B218='2. Metadata'!K$1,'2. Metadata'!K$6, IF(B218='2. Metadata'!L$1,'2. Metadata'!L$6, IF(B218='2. Metadata'!M$1,'2. Metadata'!M$6, IF(B218='2. Metadata'!N$1,'2. Metadata'!N$6))))))))))))))","v":-117.88417},"n/a",2.074,{"$f":"IF(ISBLANK(F218)=TRUE,\" \",'2. Metadata'!B$14)","v":"degrees Celsius"},1.208,{"$f":"IF(ISBLANK(H218)=TRUE,\" \",'2. Metadata'!B$26)","v":"degrees Celsius"},1.596,{"$f":"IF(ISBLANK(J218)=TRUE,\" \",'2. Metadata'!B$38)","v":"degrees Celsius"},"n/a"]
["2014-03-09","NECAR01",{"$f":"IF(ISBLANK(B219)=TRUE,\" \", IF(B219='2. Metadata'!B$1,'2. Metadata'!B$5, IF(B219='2. Metadata'!C$1,'2. Metadata'!C$5,IF(B219='2. Metadata'!D$1,'2. Metadata'!D$5, IF(B219='2. Metadata'!E$1,'2. Metadata'!E$5,IF( B219='2. Metadata'!F$1,'2. Metadata'!F$5,IF(B219='2. Metadata'!G$1,'2. Metadata'!G$5,IF(B219='2. Metadata'!H$1,'2. Metadata'!H$5, IF(B219='2. Metadata'!I$1,'2. Metadata'!I$5, IF(B219='2. Metadata'!J$1,'2. Metadata'!J$5, IF(B219='2. Metadata'!K$1,'2. Metadata'!K$5, IF(B219='2. Metadata'!L$1,'2. Metadata'!L$5, IF(B219='2. Metadata'!M$1,'2. Metadata'!M$5, IF(B219='2. Metadata'!N$1,'2. Metadata'!N$5))))))))))))))","v":49.97944},{"$f":"IF(ISBLANK(B219)=TRUE,\" \", IF(B219='2. Metadata'!B$1,'2. Metadata'!B$6, IF(B219='2. Metadata'!C$1,'2. Metadata'!C$6,IF(B219='2. Metadata'!D$1,'2. Metadata'!D$6, IF(B219='2. Metadata'!E$1,'2. Metadata'!E$6,IF( B219='2. Metadata'!F$1,'2. Metadata'!F$6,IF(B219='2. Metadata'!G$1,'2. Metadata'!G$6,IF(B219='2. Metadata'!H$1,'2. Metadata'!H$6, IF(B219='2. Metadata'!I$1,'2. Metadata'!I$6, IF(B219='2. Metadata'!J$1,'2. Metadata'!J$6, IF(B219='2. Metadata'!K$1,'2. Metadata'!K$6, IF(B219='2. Metadata'!L$1,'2. Metadata'!L$6, IF(B219='2. Metadata'!M$1,'2. Metadata'!M$6, IF(B219='2. Metadata'!N$1,'2. Metadata'!N$6))))))))))))))","v":-117.88417},"n/a",2.316,{"$f":"IF(ISBLANK(F219)=TRUE,\" \",'2. Metadata'!B$14)","v":"degrees Celsius"},0.522,{"$f":"IF(ISBLANK(H219)=TRUE,\" \",'2. Metadata'!B$26)","v":"degrees Celsius"},1.301,{"$f":"IF(ISBLANK(J219)=TRUE,\" \",'2. Metadata'!B$38)","v":"degrees Celsius"},"n/a"]
["2014-03-10","NECAR01",{"$f":"IF(ISBLANK(B220)=TRUE,\" \", IF(B220='2. Metadata'!B$1,'2. Metadata'!B$5, IF(B220='2. Metadata'!C$1,'2. Metadata'!C$5,IF(B220='2. Metadata'!D$1,'2. Metadata'!D$5, IF(B220='2. Metadata'!E$1,'2. Metadata'!E$5,IF( B220='2. Metadata'!F$1,'2. Metadata'!F$5,IF(B220='2. Metadata'!G$1,'2. Metadata'!G$5,IF(B220='2. Metadata'!H$1,'2. Metadata'!H$5, IF(B220='2. Metadata'!I$1,'2. Metadata'!I$5, IF(B220='2. Metadata'!J$1,'2. Metadata'!J$5, IF(B220='2. Metadata'!K$1,'2. Metadata'!K$5, IF(B220='2. Metadata'!L$1,'2. Metadata'!L$5, IF(B220='2. Metadata'!M$1,'2. Metadata'!M$5, IF(B220='2. Metadata'!N$1,'2. Metadata'!N$5))))))))))))))","v":49.97944},{"$f":"IF(ISBLANK(B220)=TRUE,\" \", IF(B220='2. Metadata'!B$1,'2. Metadata'!B$6, IF(B220='2. Metadata'!C$1,'2. Metadata'!C$6,IF(B220='2. Metadata'!D$1,'2. Metadata'!D$6, IF(B220='2. Metadata'!E$1,'2. Metadata'!E$6,IF( B220='2. Metadata'!F$1,'2. Metadata'!F$6,IF(B220='2. Metadata'!G$1,'2. Metadata'!G$6,IF(B220='2. Metadata'!H$1,'2. Metadata'!H$6, IF(B220='2. Metadata'!I$1,'2. Metadata'!I$6, IF(B220='2. Metadata'!J$1,'2. Metadata'!J$6, IF(B220='2. Metadata'!K$1,'2. Metadata'!K$6, IF(B220='2. Metadata'!L$1,'2. Metadata'!L$6, IF(B220='2. Metadata'!M$1,'2. Metadata'!M$6, IF(B220='2. Metadata'!N$1,'2. Metadata'!N$6))))))))))))))","v":-117.88417},"n/a",2.823,{"$f":"IF(ISBLANK(F220)=TRUE,\" \",'2. Metadata'!B$14)","v":"degrees Celsius"},1.235,{"$f":"IF(ISBLANK(H220)=TRUE,\" \",'2. Metadata'!B$26)","v":"degrees Celsius"},1.72,{"$f":"IF(ISBLANK(J220)=TRUE,\" \",'2. Metadata'!B$38)","v":"degrees Celsius"},"n/a"]
["2014-03-11","NECAR01",{"$f":"IF(ISBLANK(B221)=TRUE,\" \", IF(B221='2. Metadata'!B$1,'2. Metadata'!B$5, IF(B221='2. Metadata'!C$1,'2. Metadata'!C$5,IF(B221='2. Metadata'!D$1,'2. Metadata'!D$5, IF(B221='2. Metadata'!E$1,'2. Metadata'!E$5,IF( B221='2. Metadata'!F$1,'2. Metadata'!F$5,IF(B221='2. Metadata'!G$1,'2. Metadata'!G$5,IF(B221='2. Metadata'!H$1,'2. Metadata'!H$5, IF(B221='2. Metadata'!I$1,'2. Metadata'!I$5, IF(B221='2. Metadata'!J$1,'2. Metadata'!J$5, IF(B221='2. Metadata'!K$1,'2. Metadata'!K$5, IF(B221='2. Metadata'!L$1,'2. Metadata'!L$5, IF(B221='2. Metadata'!M$1,'2. Metadata'!M$5, IF(B221='2. Metadata'!N$1,'2. Metadata'!N$5))))))))))))))","v":49.97944},{"$f":"IF(ISBLANK(B221)=TRUE,\" \", IF(B221='2. Metadata'!B$1,'2. Metadata'!B$6, IF(B221='2. Metadata'!C$1,'2. Metadata'!C$6,IF(B221='2. Metadata'!D$1,'2. Metadata'!D$6, IF(B221='2. Metadata'!E$1,'2. Metadata'!E$6,IF( B221='2. Metadata'!F$1,'2. Metadata'!F$6,IF(B221='2. Metadata'!G$1,'2. Metadata'!G$6,IF(B221='2. Metadata'!H$1,'2. Metadata'!H$6, IF(B221='2. Metadata'!I$1,'2. Metadata'!I$6, IF(B221='2. Metadata'!J$1,'2. Metadata'!J$6, IF(B221='2. Metadata'!K$1,'2. Metadata'!K$6, IF(B221='2. Metadata'!L$1,'2. Metadata'!L$6, IF(B221='2. Metadata'!M$1,'2. Metadata'!M$6, IF(B221='2. Metadata'!N$1,'2. Metadata'!N$6))))))))))))))","v":-117.88417},"n/a",2.983,{"$f":"IF(ISBLANK(F221)=TRUE,\" \",'2. Metadata'!B$14)","v":"degrees Celsius"},0.88,{"$f":"IF(ISBLANK(H221)=TRUE,\" \",'2. Metadata'!B$26)","v":"degrees Celsius"},1.617,{"$f":"IF(ISBLANK(J221)=TRUE,\" \",'2. Metadata'!B$38)","v":"degrees Celsius"},"n/a"]
["2014-03-12","NECAR01",{"$f":"IF(ISBLANK(B222)=TRUE,\" \", IF(B222='2. Metadata'!B$1,'2. Metadata'!B$5, IF(B222='2. Metadata'!C$1,'2. Metadata'!C$5,IF(B222='2. Metadata'!D$1,'2. Metadata'!D$5, IF(B222='2. Metadata'!E$1,'2. Metadata'!E$5,IF( B222='2. Metadata'!F$1,'2. Metadata'!F$5,IF(B222='2. Metadata'!G$1,'2. Metadata'!G$5,IF(B222='2. Metadata'!H$1,'2. Metadata'!H$5, IF(B222='2. Metadata'!I$1,'2. Metadata'!I$5, IF(B222='2. Metadata'!J$1,'2. Metadata'!J$5, IF(B222='2. Metadata'!K$1,'2. Metadata'!K$5, IF(B222='2. Metadata'!L$1,'2. Metadata'!L$5, IF(B222='2. Metadata'!M$1,'2. Metadata'!M$5, IF(B222='2. Metadata'!N$1,'2. Metadata'!N$5))))))))))))))","v":49.97944},{"$f":"IF(ISBLANK(B222)=TRUE,\" \", IF(B222='2. Metadata'!B$1,'2. Metadata'!B$6, IF(B222='2. Metadata'!C$1,'2. Metadata'!C$6,IF(B222='2. Metadata'!D$1,'2. Metadata'!D$6, IF(B222='2. Metadata'!E$1,'2. Metadata'!E$6,IF( B222='2. Metadata'!F$1,'2. Metadata'!F$6,IF(B222='2. Metadata'!G$1,'2. Metadata'!G$6,IF(B222='2. Metadata'!H$1,'2. Metadata'!H$6, IF(B222='2. Metadata'!I$1,'2. Metadata'!I$6, IF(B222='2. Metadata'!J$1,'2. Metadata'!J$6, IF(B222='2. Metadata'!K$1,'2. Metadata'!K$6, IF(B222='2. Metadata'!L$1,'2. Metadata'!L$6, IF(B222='2. Metadata'!M$1,'2. Metadata'!M$6, IF(B222='2. Metadata'!N$1,'2. Metadata'!N$6))))))))))))))","v":-117.88417},"n/a",3.089,{"$f":"IF(ISBLANK(F222)=TRUE,\" \",'2. Metadata'!B$14)","v":"degrees Celsius"},0.852,{"$f":"IF(ISBLANK(H222)=TRUE,\" \",'2. Metadata'!B$26)","v":"degrees Celsius"},1.742,{"$f":"IF(ISBLANK(J222)=TRUE,\" \",'2. Metadata'!B$38)","v":"degrees Celsius"},"n/a"]
["2014-03-13","NECAR01",{"$f":"IF(ISBLANK(B223)=TRUE,\" \", IF(B223='2. Metadata'!B$1,'2. Metadata'!B$5, IF(B223='2. Metadata'!C$1,'2. Metadata'!C$5,IF(B223='2. Metadata'!D$1,'2. Metadata'!D$5, IF(B223='2. Metadata'!E$1,'2. Metadata'!E$5,IF( B223='2. Metadata'!F$1,'2. Metadata'!F$5,IF(B223='2. Metadata'!G$1,'2. Metadata'!G$5,IF(B223='2. Metadata'!H$1,'2. Metadata'!H$5, IF(B223='2. Metadata'!I$1,'2. Metadata'!I$5, IF(B223='2. Metadata'!J$1,'2. Metadata'!J$5, IF(B223='2. Metadata'!K$1,'2. Metadata'!K$5, IF(B223='2. Metadata'!L$1,'2. Metadata'!L$5, IF(B223='2. Metadata'!M$1,'2. Metadata'!M$5, IF(B223='2. Metadata'!N$1,'2. Metadata'!N$5))))))))))))))","v":49.97944},{"$f":"IF(ISBLANK(B223)=TRUE,\" \", IF(B223='2. Metadata'!B$1,'2. Metadata'!B$6, IF(B223='2. Metadata'!C$1,'2. Metadata'!C$6,IF(B223='2. Metadata'!D$1,'2. Metadata'!D$6, IF(B223='2. Metadata'!E$1,'2. Metadata'!E$6,IF( B223='2. Metadata'!F$1,'2. Metadata'!F$6,IF(B223='2. Metadata'!G$1,'2. Metadata'!G$6,IF(B223='2. Metadata'!H$1,'2. Metadata'!H$6, IF(B223='2. Metadata'!I$1,'2. Metadata'!I$6, IF(B223='2. Metadata'!J$1,'2. Metadata'!J$6, IF(B223='2. Metadata'!K$1,'2. Metadata'!K$6, IF(B223='2. Metadata'!L$1,'2. Metadata'!L$6, IF(B223='2. Metadata'!M$1,'2. Metadata'!M$6, IF(B223='2. Metadata'!N$1,'2. Metadata'!N$6))))))))))))))","v":-117.88417},"n/a",3.617,{"$f":"IF(ISBLANK(F223)=TRUE,\" \",'2. Metadata'!B$14)","v":"degrees Celsius"},1.398,{"$f":"IF(ISBLANK(H223)=TRUE,\" \",'2. Metadata'!B$26)","v":"degrees Celsius"},2.158,{"$f":"IF(ISBLANK(J223)=TRUE,\" \",'2. Metadata'!B$38)","v":"degrees Celsius"},"n/a"]
["2014-03-14","NECAR01",{"$f":"IF(ISBLANK(B224)=TRUE,\" \", IF(B224='2. Metadata'!B$1,'2. Metadata'!B$5, IF(B224='2. Metadata'!C$1,'2. Metadata'!C$5,IF(B224='2. Metadata'!D$1,'2. Metadata'!D$5, IF(B224='2. Metadata'!E$1,'2. Metadata'!E$5,IF( B224='2. Metadata'!F$1,'2. Metadata'!F$5,IF(B224='2. Metadata'!G$1,'2. Metadata'!G$5,IF(B224='2. Metadata'!H$1,'2. Metadata'!H$5, IF(B224='2. Metadata'!I$1,'2. Metadata'!I$5, IF(B224='2. Metadata'!J$1,'2. Metadata'!J$5, IF(B224='2. Metadata'!K$1,'2. Metadata'!K$5, IF(B224='2. Metadata'!L$1,'2. Metadata'!L$5, IF(B224='2. Metadata'!M$1,'2. Metadata'!M$5, IF(B224='2. Metadata'!N$1,'2. Metadata'!N$5))))))))))))))","v":49.97944},{"$f":"IF(ISBLANK(B224)=TRUE,\" \", IF(B224='2. Metadata'!B$1,'2. Metadata'!B$6, IF(B224='2. Metadata'!C$1,'2. Metadata'!C$6,IF(B224='2. Metadata'!D$1,'2. Metadata'!D$6, IF(B224='2. Metadata'!E$1,'2. Metadata'!E$6,IF( B224='2. Metadata'!F$1,'2. Metadata'!F$6,IF(B224='2. Metadata'!G$1,'2. Metadata'!G$6,IF(B224='2. Metadata'!H$1,'2. Metadata'!H$6, IF(B224='2. Metadata'!I$1,'2. Metadata'!I$6, IF(B224='2. Metadata'!J$1,'2. Metadata'!J$6, IF(B224='2. Metadata'!K$1,'2. Metadata'!K$6, IF(B224='2. Metadata'!L$1,'2. Metadata'!L$6, IF(B224='2. Metadata'!M$1,'2. Metadata'!M$6, IF(B224='2. Metadata'!N$1,'2. Metadata'!N$6))))))))))))))","v":-117.88417},"n/a",2.477,{"$f":"IF(ISBLANK(F224)=TRUE,\" \",'2. Metadata'!B$14)","v":"degrees Celsius"},1.643,{"$f":"IF(ISBLANK(H224)=TRUE,\" \",'2. Metadata'!B$26)","v":"degrees Celsius"},1.973,{"$f":"IF(ISBLANK(J224)=TRUE,\" \",'2. Metadata'!B$38)","v":"degrees Celsius"},"n/a"]
["2014-03-15","NECAR01",{"$f":"IF(ISBLANK(B225)=TRUE,\" \", IF(B225='2. Metadata'!B$1,'2. Metadata'!B$5, IF(B225='2. Metadata'!C$1,'2. Metadata'!C$5,IF(B225='2. Metadata'!D$1,'2. Metadata'!D$5, IF(B225='2. Metadata'!E$1,'2. Metadata'!E$5,IF( B225='2. Metadata'!F$1,'2. Metadata'!F$5,IF(B225='2. Metadata'!G$1,'2. Metadata'!G$5,IF(B225='2. Metadata'!H$1,'2. Metadata'!H$5, IF(B225='2. Metadata'!I$1,'2. Metadata'!I$5, IF(B225='2. Metadata'!J$1,'2. Metadata'!J$5, IF(B225='2. Metadata'!K$1,'2. Metadata'!K$5, IF(B225='2. Metadata'!L$1,'2. Metadata'!L$5, IF(B225='2. Metadata'!M$1,'2. Metadata'!M$5, IF(B225='2. Metadata'!N$1,'2. Metadata'!N$5))))))))))))))","v":49.97944},{"$f":"IF(ISBLANK(B225)=TRUE,\" \", IF(B225='2. Metadata'!B$1,'2. Metadata'!B$6, IF(B225='2. Metadata'!C$1,'2. Metadata'!C$6,IF(B225='2. Metadata'!D$1,'2. Metadata'!D$6, IF(B225='2. Metadata'!E$1,'2. Metadata'!E$6,IF( B225='2. Metadata'!F$1,'2. Metadata'!F$6,IF(B225='2. Metadata'!G$1,'2. Metadata'!G$6,IF(B225='2. Metadata'!H$1,'2. Metadata'!H$6, IF(B225='2. Metadata'!I$1,'2. Metadata'!I$6, IF(B225='2. Metadata'!J$1,'2. Metadata'!J$6, IF(B225='2. Metadata'!K$1,'2. Metadata'!K$6, IF(B225='2. Metadata'!L$1,'2. Metadata'!L$6, IF(B225='2. Metadata'!M$1,'2. Metadata'!M$6, IF(B225='2. Metadata'!N$1,'2. Metadata'!N$6))))))))))))))","v":-117.88417},"n/a",2.289,{"$f":"IF(ISBLANK(F225)=TRUE,\" \",'2. Metadata'!B$14)","v":"degrees Celsius"},1.615,{"$f":"IF(ISBLANK(H225)=TRUE,\" \",'2. Metadata'!B$26)","v":"degrees Celsius"},1.942,{"$f":"IF(ISBLANK(J225)=TRUE,\" \",'2. Metadata'!B$38)","v":"degrees Celsius"},"n/a"]
["2014-03-16","NECAR01",{"$f":"IF(ISBLANK(B226)=TRUE,\" \", IF(B226='2. Metadata'!B$1,'2. Metadata'!B$5, IF(B226='2. Metadata'!C$1,'2. Metadata'!C$5,IF(B226='2. Metadata'!D$1,'2. Metadata'!D$5, IF(B226='2. Metadata'!E$1,'2. Metadata'!E$5,IF( B226='2. Metadata'!F$1,'2. Metadata'!F$5,IF(B226='2. Metadata'!G$1,'2. Metadata'!G$5,IF(B226='2. Metadata'!H$1,'2. Metadata'!H$5, IF(B226='2. Metadata'!I$1,'2. Metadata'!I$5, IF(B226='2. Metadata'!J$1,'2. Metadata'!J$5, IF(B226='2. Metadata'!K$1,'2. Metadata'!K$5, IF(B226='2. Metadata'!L$1,'2. Metadata'!L$5, IF(B226='2. Metadata'!M$1,'2. Metadata'!M$5, IF(B226='2. Metadata'!N$1,'2. Metadata'!N$5))))))))))))))","v":49.97944},{"$f":"IF(ISBLANK(B226)=TRUE,\" \", IF(B226='2. Metadata'!B$1,'2. Metadata'!B$6, IF(B226='2. Metadata'!C$1,'2. Metadata'!C$6,IF(B226='2. Metadata'!D$1,'2. Metadata'!D$6, IF(B226='2. Metadata'!E$1,'2. Metadata'!E$6,IF( B226='2. Metadata'!F$1,'2. Metadata'!F$6,IF(B226='2. Metadata'!G$1,'2. Metadata'!G$6,IF(B226='2. Metadata'!H$1,'2. Metadata'!H$6, IF(B226='2. Metadata'!I$1,'2. Metadata'!I$6, IF(B226='2. Metadata'!J$1,'2. Metadata'!J$6, IF(B226='2. Metadata'!K$1,'2. Metadata'!K$6, IF(B226='2. Metadata'!L$1,'2. Metadata'!L$6, IF(B226='2. Metadata'!M$1,'2. Metadata'!M$6, IF(B226='2. Metadata'!N$1,'2. Metadata'!N$6))))))))))))))","v":-117.88417},"n/a",2.877,{"$f":"IF(ISBLANK(F226)=TRUE,\" \",'2. Metadata'!B$14)","v":"degrees Celsius"},1.94,{"$f":"IF(ISBLANK(H226)=TRUE,\" \",'2. Metadata'!B$26)","v":"degrees Celsius"},2.222,{"$f":"IF(ISBLANK(J226)=TRUE,\" \",'2. Metadata'!B$38)","v":"degrees Celsius"},"n/a"]
["2014-03-17","NECAR01",{"$f":"IF(ISBLANK(B227)=TRUE,\" \", IF(B227='2. Metadata'!B$1,'2. Metadata'!B$5, IF(B227='2. Metadata'!C$1,'2. Metadata'!C$5,IF(B227='2. Metadata'!D$1,'2. Metadata'!D$5, IF(B227='2. Metadata'!E$1,'2. Metadata'!E$5,IF( B227='2. Metadata'!F$1,'2. Metadata'!F$5,IF(B227='2. Metadata'!G$1,'2. Metadata'!G$5,IF(B227='2. Metadata'!H$1,'2. Metadata'!H$5, IF(B227='2. Metadata'!I$1,'2. Metadata'!I$5, IF(B227='2. Metadata'!J$1,'2. Metadata'!J$5, IF(B227='2. Metadata'!K$1,'2. Metadata'!K$5, IF(B227='2. Metadata'!L$1,'2. Metadata'!L$5, IF(B227='2. Metadata'!M$1,'2. Metadata'!M$5, IF(B227='2. Metadata'!N$1,'2. Metadata'!N$5))))))))))))))","v":49.97944},{"$f":"IF(ISBLANK(B227)=TRUE,\" \", IF(B227='2. Metadata'!B$1,'2. Metadata'!B$6, IF(B227='2. Metadata'!C$1,'2. Metadata'!C$6,IF(B227='2. Metadata'!D$1,'2. Metadata'!D$6, IF(B227='2. Metadata'!E$1,'2. Metadata'!E$6,IF( B227='2. Metadata'!F$1,'2. Metadata'!F$6,IF(B227='2. Metadata'!G$1,'2. Metadata'!G$6,IF(B227='2. Metadata'!H$1,'2. Metadata'!H$6, IF(B227='2. Metadata'!I$1,'2. Metadata'!I$6, IF(B227='2. Metadata'!J$1,'2. Metadata'!J$6, IF(B227='2. Metadata'!K$1,'2. Metadata'!K$6, IF(B227='2. Metadata'!L$1,'2. Metadata'!L$6, IF(B227='2. Metadata'!M$1,'2. Metadata'!M$6, IF(B227='2. Metadata'!N$1,'2. Metadata'!N$6))))))))))))))","v":-117.88417},"n/a",3.327,{"$f":"IF(ISBLANK(F227)=TRUE,\" \",'2. Metadata'!B$14)","v":"degrees Celsius"},1.724,{"$f":"IF(ISBLANK(H227)=TRUE,\" \",'2. Metadata'!B$26)","v":"degrees Celsius"},2.315,{"$f":"IF(ISBLANK(J227)=TRUE,\" \",'2. Metadata'!B$38)","v":"degrees Celsius"},"n/a"]
["2014-03-18","NECAR01",{"$f":"IF(ISBLANK(B228)=TRUE,\" \", IF(B228='2. Metadata'!B$1,'2. Metadata'!B$5, IF(B228='2. Metadata'!C$1,'2. Metadata'!C$5,IF(B228='2. Metadata'!D$1,'2. Metadata'!D$5, IF(B228='2. Metadata'!E$1,'2. Metadata'!E$5,IF( B228='2. Metadata'!F$1,'2. Metadata'!F$5,IF(B228='2. Metadata'!G$1,'2. Metadata'!G$5,IF(B228='2. Metadata'!H$1,'2. Metadata'!H$5, IF(B228='2. Metadata'!I$1,'2. Metadata'!I$5, IF(B228='2. Metadata'!J$1,'2. Metadata'!J$5, IF(B228='2. Metadata'!K$1,'2. Metadata'!K$5, IF(B228='2. Metadata'!L$1,'2. Metadata'!L$5, IF(B228='2. Metadata'!M$1,'2. Metadata'!M$5, IF(B228='2. Metadata'!N$1,'2. Metadata'!N$5))))))))))))))","v":49.97944},{"$f":"IF(ISBLANK(B228)=TRUE,\" \", IF(B228='2. Metadata'!B$1,'2. Metadata'!B$6, IF(B228='2. Metadata'!C$1,'2. Metadata'!C$6,IF(B228='2. Metadata'!D$1,'2. Metadata'!D$6, IF(B228='2. Metadata'!E$1,'2. Metadata'!E$6,IF( B228='2. Metadata'!F$1,'2. Metadata'!F$6,IF(B228='2. Metadata'!G$1,'2. Metadata'!G$6,IF(B228='2. Metadata'!H$1,'2. Metadata'!H$6, IF(B228='2. Metadata'!I$1,'2. Metadata'!I$6, IF(B228='2. Metadata'!J$1,'2. Metadata'!J$6, IF(B228='2. Metadata'!K$1,'2. Metadata'!K$6, IF(B228='2. Metadata'!L$1,'2. Metadata'!L$6, IF(B228='2. Metadata'!M$1,'2. Metadata'!M$6, IF(B228='2. Metadata'!N$1,'2. Metadata'!N$6))))))))))))))","v":-117.88417},"n/a",3.67,{"$f":"IF(ISBLANK(F228)=TRUE,\" \",'2. Metadata'!B$14)","v":"degrees Celsius"},1.071,{"$f":"IF(ISBLANK(H228)=TRUE,\" \",'2. Metadata'!B$26)","v":"degrees Celsius"},2.115,{"$f":"IF(ISBLANK(J228)=TRUE,\" \",'2. Metadata'!B$38)","v":"degrees Celsius"},"n/a"]
["2014-03-19","NECAR01",{"$f":"IF(ISBLANK(B229)=TRUE,\" \", IF(B229='2. Metadata'!B$1,'2. Metadata'!B$5, IF(B229='2. Metadata'!C$1,'2. Metadata'!C$5,IF(B229='2. Metadata'!D$1,'2. Metadata'!D$5, IF(B229='2. Metadata'!E$1,'2. Metadata'!E$5,IF( B229='2. Metadata'!F$1,'2. Metadata'!F$5,IF(B229='2. Metadata'!G$1,'2. Metadata'!G$5,IF(B229='2. Metadata'!H$1,'2. Metadata'!H$5, IF(B229='2. Metadata'!I$1,'2. Metadata'!I$5, IF(B229='2. Metadata'!J$1,'2. Metadata'!J$5, IF(B229='2. Metadata'!K$1,'2. Metadata'!K$5, IF(B229='2. Metadata'!L$1,'2. Metadata'!L$5, IF(B229='2. Metadata'!M$1,'2. Metadata'!M$5, IF(B229='2. Metadata'!N$1,'2. Metadata'!N$5))))))))))))))","v":49.97944},{"$f":"IF(ISBLANK(B229)=TRUE,\" \", IF(B229='2. Metadata'!B$1,'2. Metadata'!B$6, IF(B229='2. Metadata'!C$1,'2. Metadata'!C$6,IF(B229='2. Metadata'!D$1,'2. Metadata'!D$6, IF(B229='2. Metadata'!E$1,'2. Metadata'!E$6,IF( B229='2. Metadata'!F$1,'2. Metadata'!F$6,IF(B229='2. Metadata'!G$1,'2. Metadata'!G$6,IF(B229='2. Metadata'!H$1,'2. Metadata'!H$6, IF(B229='2. Metadata'!I$1,'2. Metadata'!I$6, IF(B229='2. Metadata'!J$1,'2. Metadata'!J$6, IF(B229='2. Metadata'!K$1,'2. Metadata'!K$6, IF(B229='2. Metadata'!L$1,'2. Metadata'!L$6, IF(B229='2. Metadata'!M$1,'2. Metadata'!M$6, IF(B229='2. Metadata'!N$1,'2. Metadata'!N$6))))))))))))))","v":-117.88417},"n/a",2.53,{"$f":"IF(ISBLANK(F229)=TRUE,\" \",'2. Metadata'!B$14)","v":"degrees Celsius"},1.751,{"$f":"IF(ISBLANK(H229)=TRUE,\" \",'2. Metadata'!B$26)","v":"degrees Celsius"},2.027,{"$f":"IF(ISBLANK(J229)=TRUE,\" \",'2. Metadata'!B$38)","v":"degrees Celsius"},"n/a"]
["2014-03-20","NECAR01",{"$f":"IF(ISBLANK(B230)=TRUE,\" \", IF(B230='2. Metadata'!B$1,'2. Metadata'!B$5, IF(B230='2. Metadata'!C$1,'2. Metadata'!C$5,IF(B230='2. Metadata'!D$1,'2. Metadata'!D$5, IF(B230='2. Metadata'!E$1,'2. Metadata'!E$5,IF( B230='2. Metadata'!F$1,'2. Metadata'!F$5,IF(B230='2. Metadata'!G$1,'2. Metadata'!G$5,IF(B230='2. Metadata'!H$1,'2. Metadata'!H$5, IF(B230='2. Metadata'!I$1,'2. Metadata'!I$5, IF(B230='2. Metadata'!J$1,'2. Metadata'!J$5, IF(B230='2. Metadata'!K$1,'2. Metadata'!K$5, IF(B230='2. Metadata'!L$1,'2. Metadata'!L$5, IF(B230='2. Metadata'!M$1,'2. Metadata'!M$5, IF(B230='2. Metadata'!N$1,'2. Metadata'!N$5))))))))))))))","v":49.97944},{"$f":"IF(ISBLANK(B230)=TRUE,\" \", IF(B230='2. Metadata'!B$1,'2. Metadata'!B$6, IF(B230='2. Metadata'!C$1,'2. Metadata'!C$6,IF(B230='2. Metadata'!D$1,'2. Metadata'!D$6, IF(B230='2. Metadata'!E$1,'2. Metadata'!E$6,IF( B230='2. Metadata'!F$1,'2. Metadata'!F$6,IF(B230='2. Metadata'!G$1,'2. Metadata'!G$6,IF(B230='2. Metadata'!H$1,'2. Metadata'!H$6, IF(B230='2. Metadata'!I$1,'2. Metadata'!I$6, IF(B230='2. Metadata'!J$1,'2. Metadata'!J$6, IF(B230='2. Metadata'!K$1,'2. Metadata'!K$6, IF(B230='2. Metadata'!L$1,'2. Metadata'!L$6, IF(B230='2. Metadata'!M$1,'2. Metadata'!M$6, IF(B230='2. Metadata'!N$1,'2. Metadata'!N$6))))))))))))))","v":-117.88417},"n/a",4.298,{"$f":"IF(ISBLANK(F230)=TRUE,\" \",'2. Metadata'!B$14)","v":"degrees Celsius"},1.724,{"$f":"IF(ISBLANK(H230)=TRUE,\" \",'2. Metadata'!B$26)","v":"degrees Celsius"},2.494,{"$f":"IF(ISBLANK(J230)=TRUE,\" \",'2. Metadata'!B$38)","v":"degrees Celsius"},"n/a"]
["2014-03-21","NECAR01",{"$f":"IF(ISBLANK(B231)=TRUE,\" \", IF(B231='2. Metadata'!B$1,'2. Metadata'!B$5, IF(B231='2. Metadata'!C$1,'2. Metadata'!C$5,IF(B231='2. Metadata'!D$1,'2. Metadata'!D$5, IF(B231='2. Metadata'!E$1,'2. Metadata'!E$5,IF( B231='2. Metadata'!F$1,'2. Metadata'!F$5,IF(B231='2. Metadata'!G$1,'2. Metadata'!G$5,IF(B231='2. Metadata'!H$1,'2. Metadata'!H$5, IF(B231='2. Metadata'!I$1,'2. Metadata'!I$5, IF(B231='2. Metadata'!J$1,'2. Metadata'!J$5, IF(B231='2. Metadata'!K$1,'2. Metadata'!K$5, IF(B231='2. Metadata'!L$1,'2. Metadata'!L$5, IF(B231='2. Metadata'!M$1,'2. Metadata'!M$5, IF(B231='2. Metadata'!N$1,'2. Metadata'!N$5))))))))))))))","v":49.97944},{"$f":"IF(ISBLANK(B231)=TRUE,\" \", IF(B231='2. Metadata'!B$1,'2. Metadata'!B$6, IF(B231='2. Metadata'!C$1,'2. Metadata'!C$6,IF(B231='2. Metadata'!D$1,'2. Metadata'!D$6, IF(B231='2. Metadata'!E$1,'2. Metadata'!E$6,IF( B231='2. Metadata'!F$1,'2. Metadata'!F$6,IF(B231='2. Metadata'!G$1,'2. Metadata'!G$6,IF(B231='2. Metadata'!H$1,'2. Metadata'!H$6, IF(B231='2. Metadata'!I$1,'2. Metadata'!I$6, IF(B231='2. Metadata'!J$1,'2. Metadata'!J$6, IF(B231='2. Metadata'!K$1,'2. Metadata'!K$6, IF(B231='2. Metadata'!L$1,'2. Metadata'!L$6, IF(B231='2. Metadata'!M$1,'2. Metadata'!M$6, IF(B231='2. Metadata'!N$1,'2. Metadata'!N$6))))))))))))))","v":-117.88417},"n/a",4.506,{"$f":"IF(ISBLANK(F231)=TRUE,\" \",'2. Metadata'!B$14)","v":"degrees Celsius"},1.208,{"$f":"IF(ISBLANK(H231)=TRUE,\" \",'2. Metadata'!B$26)","v":"degrees Celsius"},2.304,{"$f":"IF(ISBLANK(J231)=TRUE,\" \",'2. Metadata'!B$38)","v":"degrees Celsius"},"n/a"]
["2014-03-22","NECAR01",{"$f":"IF(ISBLANK(B232)=TRUE,\" \", IF(B232='2. Metadata'!B$1,'2. Metadata'!B$5, IF(B232='2. Metadata'!C$1,'2. Metadata'!C$5,IF(B232='2. Metadata'!D$1,'2. Metadata'!D$5, IF(B232='2. Metadata'!E$1,'2. Metadata'!E$5,IF( B232='2. Metadata'!F$1,'2. Metadata'!F$5,IF(B232='2. Metadata'!G$1,'2. Metadata'!G$5,IF(B232='2. Metadata'!H$1,'2. Metadata'!H$5, IF(B232='2. Metadata'!I$1,'2. Metadata'!I$5, IF(B232='2. Metadata'!J$1,'2. Metadata'!J$5, IF(B232='2. Metadata'!K$1,'2. Metadata'!K$5, IF(B232='2. Metadata'!L$1,'2. Metadata'!L$5, IF(B232='2. Metadata'!M$1,'2. Metadata'!M$5, IF(B232='2. Metadata'!N$1,'2. Metadata'!N$5))))))))))))))","v":49.97944},{"$f":"IF(ISBLANK(B232)=TRUE,\" \", IF(B232='2. Metadata'!B$1,'2. Metadata'!B$6, IF(B232='2. Metadata'!C$1,'2. Metadata'!C$6,IF(B232='2. Metadata'!D$1,'2. Metadata'!D$6, IF(B232='2. Metadata'!E$1,'2. Metadata'!E$6,IF( B232='2. Metadata'!F$1,'2. Metadata'!F$6,IF(B232='2. Metadata'!G$1,'2. Metadata'!G$6,IF(B232='2. Metadata'!H$1,'2. Metadata'!H$6, IF(B232='2. Metadata'!I$1,'2. Metadata'!I$6, IF(B232='2. Metadata'!J$1,'2. Metadata'!J$6, IF(B232='2. Metadata'!K$1,'2. Metadata'!K$6, IF(B232='2. Metadata'!L$1,'2. Metadata'!L$6, IF(B232='2. Metadata'!M$1,'2. Metadata'!M$6, IF(B232='2. Metadata'!N$1,'2. Metadata'!N$6))))))))))))))","v":-117.88417},"n/a",2.316,{"$f":"IF(ISBLANK(F232)=TRUE,\" \",'2. Metadata'!B$14)","v":"degrees Celsius"},0.632,{"$f":"IF(ISBLANK(H232)=TRUE,\" \",'2. Metadata'!B$26)","v":"degrees Celsius"},1.486,{"$f":"IF(ISBLANK(J232)=TRUE,\" \",'2. Metadata'!B$38)","v":"degrees Celsius"},"n/a"]
["2014-03-23","NECAR01",{"$f":"IF(ISBLANK(B233)=TRUE,\" \", IF(B233='2. Metadata'!B$1,'2. Metadata'!B$5, IF(B233='2. Metadata'!C$1,'2. Metadata'!C$5,IF(B233='2. Metadata'!D$1,'2. Metadata'!D$5, IF(B233='2. Metadata'!E$1,'2. Metadata'!E$5,IF( B233='2. Metadata'!F$1,'2. Metadata'!F$5,IF(B233='2. Metadata'!G$1,'2. Metadata'!G$5,IF(B233='2. Metadata'!H$1,'2. Metadata'!H$5, IF(B233='2. Metadata'!I$1,'2. Metadata'!I$5, IF(B233='2. Metadata'!J$1,'2. Metadata'!J$5, IF(B233='2. Metadata'!K$1,'2. Metadata'!K$5, IF(B233='2. Metadata'!L$1,'2. Metadata'!L$5, IF(B233='2. Metadata'!M$1,'2. Metadata'!M$5, IF(B233='2. Metadata'!N$1,'2. Metadata'!N$5))))))))))))))","v":49.97944},{"$f":"IF(ISBLANK(B233)=TRUE,\" \", IF(B233='2. Metadata'!B$1,'2. Metadata'!B$6, IF(B233='2. Metadata'!C$1,'2. Metadata'!C$6,IF(B233='2. Metadata'!D$1,'2. Metadata'!D$6, IF(B233='2. Metadata'!E$1,'2. Metadata'!E$6,IF( B233='2. Metadata'!F$1,'2. Metadata'!F$6,IF(B233='2. Metadata'!G$1,'2. Metadata'!G$6,IF(B233='2. Metadata'!H$1,'2. Metadata'!H$6, IF(B233='2. Metadata'!I$1,'2. Metadata'!I$6, IF(B233='2. Metadata'!J$1,'2. Metadata'!J$6, IF(B233='2. Metadata'!K$1,'2. Metadata'!K$6, IF(B233='2. Metadata'!L$1,'2. Metadata'!L$6, IF(B233='2. Metadata'!M$1,'2. Metadata'!M$6, IF(B233='2. Metadata'!N$1,'2. Metadata'!N$6))))))))))))))","v":-117.88417},"n/a",4.558,{"$f":"IF(ISBLANK(F233)=TRUE,\" \",'2. Metadata'!B$14)","v":"degrees Celsius"},1.453,{"$f":"IF(ISBLANK(H233)=TRUE,\" \",'2. Metadata'!B$26)","v":"degrees Celsius"},2.419,{"$f":"IF(ISBLANK(J233)=TRUE,\" \",'2. Metadata'!B$38)","v":"degrees Celsius"},"n/a"]
["2014-03-24","NECAR01",{"$f":"IF(ISBLANK(B234)=TRUE,\" \", IF(B234='2. Metadata'!B$1,'2. Metadata'!B$5, IF(B234='2. Metadata'!C$1,'2. Metadata'!C$5,IF(B234='2. Metadata'!D$1,'2. Metadata'!D$5, IF(B234='2. Metadata'!E$1,'2. Metadata'!E$5,IF( B234='2. Metadata'!F$1,'2. Metadata'!F$5,IF(B234='2. Metadata'!G$1,'2. Metadata'!G$5,IF(B234='2. Metadata'!H$1,'2. Metadata'!H$5, IF(B234='2. Metadata'!I$1,'2. Metadata'!I$5, IF(B234='2. Metadata'!J$1,'2. Metadata'!J$5, IF(B234='2. Metadata'!K$1,'2. Metadata'!K$5, IF(B234='2. Metadata'!L$1,'2. Metadata'!L$5, IF(B234='2. Metadata'!M$1,'2. Metadata'!M$5, IF(B234='2. Metadata'!N$1,'2. Metadata'!N$5))))))))))))))","v":49.97944},{"$f":"IF(ISBLANK(B234)=TRUE,\" \", IF(B234='2. Metadata'!B$1,'2. Metadata'!B$6, IF(B234='2. Metadata'!C$1,'2. Metadata'!C$6,IF(B234='2. Metadata'!D$1,'2. Metadata'!D$6, IF(B234='2. Metadata'!E$1,'2. Metadata'!E$6,IF( B234='2. Metadata'!F$1,'2. Metadata'!F$6,IF(B234='2. Metadata'!G$1,'2. Metadata'!G$6,IF(B234='2. Metadata'!H$1,'2. Metadata'!H$6, IF(B234='2. Metadata'!I$1,'2. Metadata'!I$6, IF(B234='2. Metadata'!J$1,'2. Metadata'!J$6, IF(B234='2. Metadata'!K$1,'2. Metadata'!K$6, IF(B234='2. Metadata'!L$1,'2. Metadata'!L$6, IF(B234='2. Metadata'!M$1,'2. Metadata'!M$6, IF(B234='2. Metadata'!N$1,'2. Metadata'!N$6))))))))))))))","v":-117.88417},"n/a",4.063,{"$f":"IF(ISBLANK(F234)=TRUE,\" \",'2. Metadata'!B$14)","v":"degrees Celsius"},1.017,{"$f":"IF(ISBLANK(H234)=TRUE,\" \",'2. Metadata'!B$26)","v":"degrees Celsius"},2.235,{"$f":"IF(ISBLANK(J234)=TRUE,\" \",'2. Metadata'!B$38)","v":"degrees Celsius"},"n/a"]
["2014-03-25","NECAR01",{"$f":"IF(ISBLANK(B235)=TRUE,\" \", IF(B235='2. Metadata'!B$1,'2. Metadata'!B$5, IF(B235='2. Metadata'!C$1,'2. Metadata'!C$5,IF(B235='2. Metadata'!D$1,'2. Metadata'!D$5, IF(B235='2. Metadata'!E$1,'2. Metadata'!E$5,IF( B235='2. Metadata'!F$1,'2. Metadata'!F$5,IF(B235='2. Metadata'!G$1,'2. Metadata'!G$5,IF(B235='2. Metadata'!H$1,'2. Metadata'!H$5, IF(B235='2. Metadata'!I$1,'2. Metadata'!I$5, IF(B235='2. Metadata'!J$1,'2. Metadata'!J$5, IF(B235='2. Metadata'!K$1,'2. Metadata'!K$5, IF(B235='2. Metadata'!L$1,'2. Metadata'!L$5, IF(B235='2. Metadata'!M$1,'2. Metadata'!M$5, IF(B235='2. Metadata'!N$1,'2. Metadata'!N$5))))))))))))))","v":49.97944},{"$f":"IF(ISBLANK(B235)=TRUE,\" \", IF(B235='2. Metadata'!B$1,'2. Metadata'!B$6, IF(B235='2. Metadata'!C$1,'2. Metadata'!C$6,IF(B235='2. Metadata'!D$1,'2. Metadata'!D$6, IF(B235='2. Metadata'!E$1,'2. Metadata'!E$6,IF( B235='2. Metadata'!F$1,'2. Metadata'!F$6,IF(B235='2. Metadata'!G$1,'2. Metadata'!G$6,IF(B235='2. Metadata'!H$1,'2. Metadata'!H$6, IF(B235='2. Metadata'!I$1,'2. Metadata'!I$6, IF(B235='2. Metadata'!J$1,'2. Metadata'!J$6, IF(B235='2. Metadata'!K$1,'2. Metadata'!K$6, IF(B235='2. Metadata'!L$1,'2. Metadata'!L$6, IF(B235='2. Metadata'!M$1,'2. Metadata'!M$6, IF(B235='2. Metadata'!N$1,'2. Metadata'!N$6))))))))))))))","v":-117.88417},"n/a",3.749,{"$f":"IF(ISBLANK(F235)=TRUE,\" \",'2. Metadata'!B$14)","v":"degrees Celsius"},1.453,{"$f":"IF(ISBLANK(H235)=TRUE,\" \",'2. Metadata'!B$26)","v":"degrees Celsius"},2.402,{"$f":"IF(ISBLANK(J235)=TRUE,\" \",'2. Metadata'!B$38)","v":"degrees Celsius"},"n/a"]
["2014-03-26","NECAR01",{"$f":"IF(ISBLANK(B236)=TRUE,\" \", IF(B236='2. Metadata'!B$1,'2. Metadata'!B$5, IF(B236='2. Metadata'!C$1,'2. Metadata'!C$5,IF(B236='2. Metadata'!D$1,'2. Metadata'!D$5, IF(B236='2. Metadata'!E$1,'2. Metadata'!E$5,IF( B236='2. Metadata'!F$1,'2. Metadata'!F$5,IF(B236='2. Metadata'!G$1,'2. Metadata'!G$5,IF(B236='2. Metadata'!H$1,'2. Metadata'!H$5, IF(B236='2. Metadata'!I$1,'2. Metadata'!I$5, IF(B236='2. Metadata'!J$1,'2. Metadata'!J$5, IF(B236='2. Metadata'!K$1,'2. Metadata'!K$5, IF(B236='2. Metadata'!L$1,'2. Metadata'!L$5, IF(B236='2. Metadata'!M$1,'2. Metadata'!M$5, IF(B236='2. Metadata'!N$1,'2. Metadata'!N$5))))))))))))))","v":49.97944},{"$f":"IF(ISBLANK(B236)=TRUE,\" \", IF(B236='2. Metadata'!B$1,'2. Metadata'!B$6, IF(B236='2. Metadata'!C$1,'2. Metadata'!C$6,IF(B236='2. Metadata'!D$1,'2. Metadata'!D$6, IF(B236='2. Metadata'!E$1,'2. Metadata'!E$6,IF( B236='2. Metadata'!F$1,'2. Metadata'!F$6,IF(B236='2. Metadata'!G$1,'2. Metadata'!G$6,IF(B236='2. Metadata'!H$1,'2. Metadata'!H$6, IF(B236='2. Metadata'!I$1,'2. Metadata'!I$6, IF(B236='2. Metadata'!J$1,'2. Metadata'!J$6, IF(B236='2. Metadata'!K$1,'2. Metadata'!K$6, IF(B236='2. Metadata'!L$1,'2. Metadata'!L$6, IF(B236='2. Metadata'!M$1,'2. Metadata'!M$6, IF(B236='2. Metadata'!N$1,'2. Metadata'!N$6))))))))))))))","v":-117.88417},"n/a",4.454,{"$f":"IF(ISBLANK(F236)=TRUE,\" \",'2. Metadata'!B$14)","v":"degrees Celsius"},2.047,{"$f":"IF(ISBLANK(H236)=TRUE,\" \",'2. Metadata'!B$26)","v":"degrees Celsius"},3.016,{"$f":"IF(ISBLANK(J236)=TRUE,\" \",'2. Metadata'!B$38)","v":"degrees Celsius"},"n/a"]
["2014-03-27","NECAR01",{"$f":"IF(ISBLANK(B237)=TRUE,\" \", IF(B237='2. Metadata'!B$1,'2. Metadata'!B$5, IF(B237='2. Metadata'!C$1,'2. Metadata'!C$5,IF(B237='2. Metadata'!D$1,'2. Metadata'!D$5, IF(B237='2. Metadata'!E$1,'2. Metadata'!E$5,IF( B237='2. Metadata'!F$1,'2. Metadata'!F$5,IF(B237='2. Metadata'!G$1,'2. Metadata'!G$5,IF(B237='2. Metadata'!H$1,'2. Metadata'!H$5, IF(B237='2. Metadata'!I$1,'2. Metadata'!I$5, IF(B237='2. Metadata'!J$1,'2. Metadata'!J$5, IF(B237='2. Metadata'!K$1,'2. Metadata'!K$5, IF(B237='2. Metadata'!L$1,'2. Metadata'!L$5, IF(B237='2. Metadata'!M$1,'2. Metadata'!M$5, IF(B237='2. Metadata'!N$1,'2. Metadata'!N$5))))))))))))))","v":49.97944},{"$f":"IF(ISBLANK(B237)=TRUE,\" \", IF(B237='2. Metadata'!B$1,'2. Metadata'!B$6, IF(B237='2. Metadata'!C$1,'2. Metadata'!C$6,IF(B237='2. Metadata'!D$1,'2. Metadata'!D$6, IF(B237='2. Metadata'!E$1,'2. Metadata'!E$6,IF( B237='2. Metadata'!F$1,'2. Metadata'!F$6,IF(B237='2. Metadata'!G$1,'2. Metadata'!G$6,IF(B237='2. Metadata'!H$1,'2. Metadata'!H$6, IF(B237='2. Metadata'!I$1,'2. Metadata'!I$6, IF(B237='2. Metadata'!J$1,'2. Metadata'!J$6, IF(B237='2. Metadata'!K$1,'2. Metadata'!K$6, IF(B237='2. Metadata'!L$1,'2. Metadata'!L$6, IF(B237='2. Metadata'!M$1,'2. Metadata'!M$6, IF(B237='2. Metadata'!N$1,'2. Metadata'!N$6))))))))))))))","v":-117.88417},"n/a",5.462,{"$f":"IF(ISBLANK(F237)=TRUE,\" \",'2. Metadata'!B$14)","v":"degrees Celsius"},2.021,{"$f":"IF(ISBLANK(H237)=TRUE,\" \",'2. Metadata'!B$26)","v":"degrees Celsius"},3.309,{"$f":"IF(ISBLANK(J237)=TRUE,\" \",'2. Metadata'!B$38)","v":"degrees Celsius"},"n/a"]
["2014-03-28","NECAR01",{"$f":"IF(ISBLANK(B238)=TRUE,\" \", IF(B238='2. Metadata'!B$1,'2. Metadata'!B$5, IF(B238='2. Metadata'!C$1,'2. Metadata'!C$5,IF(B238='2. Metadata'!D$1,'2. Metadata'!D$5, IF(B238='2. Metadata'!E$1,'2. Metadata'!E$5,IF( B238='2. Metadata'!F$1,'2. Metadata'!F$5,IF(B238='2. Metadata'!G$1,'2. Metadata'!G$5,IF(B238='2. Metadata'!H$1,'2. Metadata'!H$5, IF(B238='2. Metadata'!I$1,'2. Metadata'!I$5, IF(B238='2. Metadata'!J$1,'2. Metadata'!J$5, IF(B238='2. Metadata'!K$1,'2. Metadata'!K$5, IF(B238='2. Metadata'!L$1,'2. Metadata'!L$5, IF(B238='2. Metadata'!M$1,'2. Metadata'!M$5, IF(B238='2. Metadata'!N$1,'2. Metadata'!N$5))))))))))))))","v":49.97944},{"$f":"IF(ISBLANK(B238)=TRUE,\" \", IF(B238='2. Metadata'!B$1,'2. Metadata'!B$6, IF(B238='2. Metadata'!C$1,'2. Metadata'!C$6,IF(B238='2. Metadata'!D$1,'2. Metadata'!D$6, IF(B238='2. Metadata'!E$1,'2. Metadata'!E$6,IF( B238='2. Metadata'!F$1,'2. Metadata'!F$6,IF(B238='2. Metadata'!G$1,'2. Metadata'!G$6,IF(B238='2. Metadata'!H$1,'2. Metadata'!H$6, IF(B238='2. Metadata'!I$1,'2. Metadata'!I$6, IF(B238='2. Metadata'!J$1,'2. Metadata'!J$6, IF(B238='2. Metadata'!K$1,'2. Metadata'!K$6, IF(B238='2. Metadata'!L$1,'2. Metadata'!L$6, IF(B238='2. Metadata'!M$1,'2. Metadata'!M$6, IF(B238='2. Metadata'!N$1,'2. Metadata'!N$6))))))))))))))","v":-117.88417},"n/a",3.985,{"$f":"IF(ISBLANK(F238)=TRUE,\" \",'2. Metadata'!B$14)","v":"degrees Celsius"},2.101,{"$f":"IF(ISBLANK(H238)=TRUE,\" \",'2. Metadata'!B$26)","v":"degrees Celsius"},3.007,{"$f":"IF(ISBLANK(J238)=TRUE,\" \",'2. Metadata'!B$38)","v":"degrees Celsius"},"n/a"]
["2014-03-29","NECAR01",{"$f":"IF(ISBLANK(B239)=TRUE,\" \", IF(B239='2. Metadata'!B$1,'2. Metadata'!B$5, IF(B239='2. Metadata'!C$1,'2. Metadata'!C$5,IF(B239='2. Metadata'!D$1,'2. Metadata'!D$5, IF(B239='2. Metadata'!E$1,'2. Metadata'!E$5,IF( B239='2. Metadata'!F$1,'2. Metadata'!F$5,IF(B239='2. Metadata'!G$1,'2. Metadata'!G$5,IF(B239='2. Metadata'!H$1,'2. Metadata'!H$5, IF(B239='2. Metadata'!I$1,'2. Metadata'!I$5, IF(B239='2. Metadata'!J$1,'2. Metadata'!J$5, IF(B239='2. Metadata'!K$1,'2. Metadata'!K$5, IF(B239='2. Metadata'!L$1,'2. Metadata'!L$5, IF(B239='2. Metadata'!M$1,'2. Metadata'!M$5, IF(B239='2. Metadata'!N$1,'2. Metadata'!N$5))))))))))))))","v":49.97944},{"$f":"IF(ISBLANK(B239)=TRUE,\" \", IF(B239='2. Metadata'!B$1,'2. Metadata'!B$6, IF(B239='2. Metadata'!C$1,'2. Metadata'!C$6,IF(B239='2. Metadata'!D$1,'2. Metadata'!D$6, IF(B239='2. Metadata'!E$1,'2. Metadata'!E$6,IF( B239='2. Metadata'!F$1,'2. Metadata'!F$6,IF(B239='2. Metadata'!G$1,'2. Metadata'!G$6,IF(B239='2. Metadata'!H$1,'2. Metadata'!H$6, IF(B239='2. Metadata'!I$1,'2. Metadata'!I$6, IF(B239='2. Metadata'!J$1,'2. Metadata'!J$6, IF(B239='2. Metadata'!K$1,'2. Metadata'!K$6, IF(B239='2. Metadata'!L$1,'2. Metadata'!L$6, IF(B239='2. Metadata'!M$1,'2. Metadata'!M$6, IF(B239='2. Metadata'!N$1,'2. Metadata'!N$6))))))))))))))","v":-117.88417},"n/a",4.688,{"$f":"IF(ISBLANK(F239)=TRUE,\" \",'2. Metadata'!B$14)","v":"degrees Celsius"},2.45,{"$f":"IF(ISBLANK(H239)=TRUE,\" \",'2. Metadata'!B$26)","v":"degrees Celsius"},3.382,{"$f":"IF(ISBLANK(J239)=TRUE,\" \",'2. Metadata'!B$38)","v":"degrees Celsius"},"n/a"]
["2014-03-30","NECAR01",{"$f":"IF(ISBLANK(B240)=TRUE,\" \", IF(B240='2. Metadata'!B$1,'2. Metadata'!B$5, IF(B240='2. Metadata'!C$1,'2. Metadata'!C$5,IF(B240='2. Metadata'!D$1,'2. Metadata'!D$5, IF(B240='2. Metadata'!E$1,'2. Metadata'!E$5,IF( B240='2. Metadata'!F$1,'2. Metadata'!F$5,IF(B240='2. Metadata'!G$1,'2. Metadata'!G$5,IF(B240='2. Metadata'!H$1,'2. Metadata'!H$5, IF(B240='2. Metadata'!I$1,'2. Metadata'!I$5, IF(B240='2. Metadata'!J$1,'2. Metadata'!J$5, IF(B240='2. Metadata'!K$1,'2. Metadata'!K$5, IF(B240='2. Metadata'!L$1,'2. Metadata'!L$5, IF(B240='2. Metadata'!M$1,'2. Metadata'!M$5, IF(B240='2. Metadata'!N$1,'2. Metadata'!N$5))))))))))))))","v":49.97944},{"$f":"IF(ISBLANK(B240)=TRUE,\" \", IF(B240='2. Metadata'!B$1,'2. Metadata'!B$6, IF(B240='2. Metadata'!C$1,'2. Metadata'!C$6,IF(B240='2. Metadata'!D$1,'2. Metadata'!D$6, IF(B240='2. Metadata'!E$1,'2. Metadata'!E$6,IF( B240='2. Metadata'!F$1,'2. Metadata'!F$6,IF(B240='2. Metadata'!G$1,'2. Metadata'!G$6,IF(B240='2. Metadata'!H$1,'2. Metadata'!H$6, IF(B240='2. Metadata'!I$1,'2. Metadata'!I$6, IF(B240='2. Metadata'!J$1,'2. Metadata'!J$6, IF(B240='2. Metadata'!K$1,'2. Metadata'!K$6, IF(B240='2. Metadata'!L$1,'2. Metadata'!L$6, IF(B240='2. Metadata'!M$1,'2. Metadata'!M$6, IF(B240='2. Metadata'!N$1,'2. Metadata'!N$6))))))))))))))","v":-117.88417},"n/a",5.411,{"$f":"IF(ISBLANK(F240)=TRUE,\" \",'2. Metadata'!B$14)","v":"degrees Celsius"},2.557,{"$f":"IF(ISBLANK(H240)=TRUE,\" \",'2. Metadata'!B$26)","v":"degrees Celsius"},3.548,{"$f":"IF(ISBLANK(J240)=TRUE,\" \",'2. Metadata'!B$38)","v":"degrees Celsius"},"n/a"]
["2014-03-31","NECAR01",{"$f":"IF(ISBLANK(B241)=TRUE,\" \", IF(B241='2. Metadata'!B$1,'2. Metadata'!B$5, IF(B241='2. Metadata'!C$1,'2. Metadata'!C$5,IF(B241='2. Metadata'!D$1,'2. Metadata'!D$5, IF(B241='2. Metadata'!E$1,'2. Metadata'!E$5,IF( B241='2. Metadata'!F$1,'2. Metadata'!F$5,IF(B241='2. Metadata'!G$1,'2. Metadata'!G$5,IF(B241='2. Metadata'!H$1,'2. Metadata'!H$5, IF(B241='2. Metadata'!I$1,'2. Metadata'!I$5, IF(B241='2. Metadata'!J$1,'2. Metadata'!J$5, IF(B241='2. Metadata'!K$1,'2. Metadata'!K$5, IF(B241='2. Metadata'!L$1,'2. Metadata'!L$5, IF(B241='2. Metadata'!M$1,'2. Metadata'!M$5, IF(B241='2. Metadata'!N$1,'2. Metadata'!N$5))))))))))))))","v":49.97944},{"$f":"IF(ISBLANK(B241)=TRUE,\" \", IF(B241='2. Metadata'!B$1,'2. Metadata'!B$6, IF(B241='2. Metadata'!C$1,'2. Metadata'!C$6,IF(B241='2. Metadata'!D$1,'2. Metadata'!D$6, IF(B241='2. Metadata'!E$1,'2. Metadata'!E$6,IF( B241='2. Metadata'!F$1,'2. Metadata'!F$6,IF(B241='2. Metadata'!G$1,'2. Metadata'!G$6,IF(B241='2. Metadata'!H$1,'2. Metadata'!H$6, IF(B241='2. Metadata'!I$1,'2. Metadata'!I$6, IF(B241='2. Metadata'!J$1,'2. Metadata'!J$6, IF(B241='2. Metadata'!K$1,'2. Metadata'!K$6, IF(B241='2. Metadata'!L$1,'2. Metadata'!L$6, IF(B241='2. Metadata'!M$1,'2. Metadata'!M$6, IF(B241='2. Metadata'!N$1,'2. Metadata'!N$6))))))))))))))","v":-117.88417},"n/a",5.591,{"$f":"IF(ISBLANK(F241)=TRUE,\" \",'2. Metadata'!B$14)","v":"degrees Celsius"},2.128,{"$f":"IF(ISBLANK(H241)=TRUE,\" \",'2. Metadata'!B$26)","v":"degrees Celsius"},3.423,{"$f":"IF(ISBLANK(J241)=TRUE,\" \",'2. Metadata'!B$38)","v":"degrees Celsius"},"n/a"]
["2014-04-01","NECAR01",{"$f":"IF(ISBLANK(B242)=TRUE,\" \", IF(B242='2. Metadata'!B$1,'2. Metadata'!B$5, IF(B242='2. Metadata'!C$1,'2. Metadata'!C$5,IF(B242='2. Metadata'!D$1,'2. Metadata'!D$5, IF(B242='2. Metadata'!E$1,'2. Metadata'!E$5,IF( B242='2. Metadata'!F$1,'2. Metadata'!F$5,IF(B242='2. Metadata'!G$1,'2. Metadata'!G$5,IF(B242='2. Metadata'!H$1,'2. Metadata'!H$5, IF(B242='2. Metadata'!I$1,'2. Metadata'!I$5, IF(B242='2. Metadata'!J$1,'2. Metadata'!J$5, IF(B242='2. Metadata'!K$1,'2. Metadata'!K$5, IF(B242='2. Metadata'!L$1,'2. Metadata'!L$5, IF(B242='2. Metadata'!M$1,'2. Metadata'!M$5, IF(B242='2. Metadata'!N$1,'2. Metadata'!N$5))))))))))))))","v":49.97944},{"$f":"IF(ISBLANK(B242)=TRUE,\" \", IF(B242='2. Metadata'!B$1,'2. Metadata'!B$6, IF(B242='2. Metadata'!C$1,'2. Metadata'!C$6,IF(B242='2. Metadata'!D$1,'2. Metadata'!D$6, IF(B242='2. Metadata'!E$1,'2. Metadata'!E$6,IF( B242='2. Metadata'!F$1,'2. Metadata'!F$6,IF(B242='2. Metadata'!G$1,'2. Metadata'!G$6,IF(B242='2. Metadata'!H$1,'2. Metadata'!H$6, IF(B242='2. Metadata'!I$1,'2. Metadata'!I$6, IF(B242='2. Metadata'!J$1,'2. Metadata'!J$6, IF(B242='2. Metadata'!K$1,'2. Metadata'!K$6, IF(B242='2. Metadata'!L$1,'2. Metadata'!L$6, IF(B242='2. Metadata'!M$1,'2. Metadata'!M$6, IF(B242='2. Metadata'!N$1,'2. Metadata'!N$6))))))))))))))","v":-117.88417},"n/a",6.179,{"$f":"IF(ISBLANK(F242)=TRUE,\" \",'2. Metadata'!B$14)","v":"degrees Celsius"},2.316,{"$f":"IF(ISBLANK(H242)=TRUE,\" \",'2. Metadata'!B$26)","v":"degrees Celsius"},3.663,{"$f":"IF(ISBLANK(J242)=TRUE,\" \",'2. Metadata'!B$38)","v":"degrees Celsius"},"n/a"]
["2014-04-02","NECAR01",{"$f":"IF(ISBLANK(B243)=TRUE,\" \", IF(B243='2. Metadata'!B$1,'2. Metadata'!B$5, IF(B243='2. Metadata'!C$1,'2. Metadata'!C$5,IF(B243='2. Metadata'!D$1,'2. Metadata'!D$5, IF(B243='2. Metadata'!E$1,'2. Metadata'!E$5,IF( B243='2. Metadata'!F$1,'2. Metadata'!F$5,IF(B243='2. Metadata'!G$1,'2. Metadata'!G$5,IF(B243='2. Metadata'!H$1,'2. Metadata'!H$5, IF(B243='2. Metadata'!I$1,'2. Metadata'!I$5, IF(B243='2. Metadata'!J$1,'2. Metadata'!J$5, IF(B243='2. Metadata'!K$1,'2. Metadata'!K$5, IF(B243='2. Metadata'!L$1,'2. Metadata'!L$5, IF(B243='2. Metadata'!M$1,'2. Metadata'!M$5, IF(B243='2. Metadata'!N$1,'2. Metadata'!N$5))))))))))))))","v":49.97944},{"$f":"IF(ISBLANK(B243)=TRUE,\" \", IF(B243='2. Metadata'!B$1,'2. Metadata'!B$6, IF(B243='2. Metadata'!C$1,'2. Metadata'!C$6,IF(B243='2. Metadata'!D$1,'2. Metadata'!D$6, IF(B243='2. Metadata'!E$1,'2. Metadata'!E$6,IF( B243='2. Metadata'!F$1,'2. Metadata'!F$6,IF(B243='2. Metadata'!G$1,'2. Metadata'!G$6,IF(B243='2. Metadata'!H$1,'2. Metadata'!H$6, IF(B243='2. Metadata'!I$1,'2. Metadata'!I$6, IF(B243='2. Metadata'!J$1,'2. Metadata'!J$6, IF(B243='2. Metadata'!K$1,'2. Metadata'!K$6, IF(B243='2. Metadata'!L$1,'2. Metadata'!L$6, IF(B243='2. Metadata'!M$1,'2. Metadata'!M$6, IF(B243='2. Metadata'!N$1,'2. Metadata'!N$6))))))))))))))","v":-117.88417},"n/a",5.411,{"$f":"IF(ISBLANK(F243)=TRUE,\" \",'2. Metadata'!B$14)","v":"degrees Celsius"},1.67,{"$f":"IF(ISBLANK(H243)=TRUE,\" \",'2. Metadata'!B$26)","v":"degrees Celsius"},3.155,{"$f":"IF(ISBLANK(J243)=TRUE,\" \",'2. Metadata'!B$38)","v":"degrees Celsius"},"n/a"]
["2014-04-03","NECAR01",{"$f":"IF(ISBLANK(B244)=TRUE,\" \", IF(B244='2. Metadata'!B$1,'2. Metadata'!B$5, IF(B244='2. Metadata'!C$1,'2. Metadata'!C$5,IF(B244='2. Metadata'!D$1,'2. Metadata'!D$5, IF(B244='2. Metadata'!E$1,'2. Metadata'!E$5,IF( B244='2. Metadata'!F$1,'2. Metadata'!F$5,IF(B244='2. Metadata'!G$1,'2. Metadata'!G$5,IF(B244='2. Metadata'!H$1,'2. Metadata'!H$5, IF(B244='2. Metadata'!I$1,'2. Metadata'!I$5, IF(B244='2. Metadata'!J$1,'2. Metadata'!J$5, IF(B244='2. Metadata'!K$1,'2. Metadata'!K$5, IF(B244='2. Metadata'!L$1,'2. Metadata'!L$5, IF(B244='2. Metadata'!M$1,'2. Metadata'!M$5, IF(B244='2. Metadata'!N$1,'2. Metadata'!N$5))))))))))))))","v":49.97944},{"$f":"IF(ISBLANK(B244)=TRUE,\" \", IF(B244='2. Metadata'!B$1,'2. Metadata'!B$6, IF(B244='2. Metadata'!C$1,'2. Metadata'!C$6,IF(B244='2. Metadata'!D$1,'2. Metadata'!D$6, IF(B244='2. Metadata'!E$1,'2. Metadata'!E$6,IF( B244='2. Metadata'!F$1,'2. Metadata'!F$6,IF(B244='2. Metadata'!G$1,'2. Metadata'!G$6,IF(B244='2. Metadata'!H$1,'2. Metadata'!H$6, IF(B244='2. Metadata'!I$1,'2. Metadata'!I$6, IF(B244='2. Metadata'!J$1,'2. Metadata'!J$6, IF(B244='2. Metadata'!K$1,'2. Metadata'!K$6, IF(B244='2. Metadata'!L$1,'2. Metadata'!L$6, IF(B244='2. Metadata'!M$1,'2. Metadata'!M$6, IF(B244='2. Metadata'!N$1,'2. Metadata'!N$6))))))))))))))","v":-117.88417},"n/a",5.024,{"$f":"IF(ISBLANK(F244)=TRUE,\" \",'2. Metadata'!B$14)","v":"degrees Celsius"},2.101,{"$f":"IF(ISBLANK(H244)=TRUE,\" \",'2. Metadata'!B$26)","v":"degrees Celsius"},3.46,{"$f":"IF(ISBLANK(J244)=TRUE,\" \",'2. Metadata'!B$38)","v":"degrees Celsius"},"n/a"]
["2014-04-04","NECAR01",{"$f":"IF(ISBLANK(B245)=TRUE,\" \", IF(B245='2. Metadata'!B$1,'2. Metadata'!B$5, IF(B245='2. Metadata'!C$1,'2. Metadata'!C$5,IF(B245='2. Metadata'!D$1,'2. Metadata'!D$5, IF(B245='2. Metadata'!E$1,'2. Metadata'!E$5,IF( B245='2. Metadata'!F$1,'2. Metadata'!F$5,IF(B245='2. Metadata'!G$1,'2. Metadata'!G$5,IF(B245='2. Metadata'!H$1,'2. Metadata'!H$5, IF(B245='2. Metadata'!I$1,'2. Metadata'!I$5, IF(B245='2. Metadata'!J$1,'2. Metadata'!J$5, IF(B245='2. Metadata'!K$1,'2. Metadata'!K$5, IF(B245='2. Metadata'!L$1,'2. Metadata'!L$5, IF(B245='2. Metadata'!M$1,'2. Metadata'!M$5, IF(B245='2. Metadata'!N$1,'2. Metadata'!N$5))))))))))))))","v":49.97944},{"$f":"IF(ISBLANK(B245)=TRUE,\" \", IF(B245='2. Metadata'!B$1,'2. Metadata'!B$6, IF(B245='2. Metadata'!C$1,'2. Metadata'!C$6,IF(B245='2. Metadata'!D$1,'2. Metadata'!D$6, IF(B245='2. Metadata'!E$1,'2. Metadata'!E$6,IF( B245='2. Metadata'!F$1,'2. Metadata'!F$6,IF(B245='2. Metadata'!G$1,'2. Metadata'!G$6,IF(B245='2. Metadata'!H$1,'2. Metadata'!H$6, IF(B245='2. Metadata'!I$1,'2. Metadata'!I$6, IF(B245='2. Metadata'!J$1,'2. Metadata'!J$6, IF(B245='2. Metadata'!K$1,'2. Metadata'!K$6, IF(B245='2. Metadata'!L$1,'2. Metadata'!L$6, IF(B245='2. Metadata'!M$1,'2. Metadata'!M$6, IF(B245='2. Metadata'!N$1,'2. Metadata'!N$6))))))))))))))","v":-117.88417},"n/a",6.509,{"$f":"IF(ISBLANK(F245)=TRUE,\" \",'2. Metadata'!B$14)","v":"degrees Celsius"},2.983,{"$f":"IF(ISBLANK(H245)=TRUE,\" \",'2. Metadata'!B$26)","v":"degrees Celsius"},4.253,{"$f":"IF(ISBLANK(J245)=TRUE,\" \",'2. Metadata'!B$38)","v":"degrees Celsius"},"n/a"]
["2014-04-05","NECAR01",{"$f":"IF(ISBLANK(B246)=TRUE,\" \", IF(B246='2. Metadata'!B$1,'2. Metadata'!B$5, IF(B246='2. Metadata'!C$1,'2. Metadata'!C$5,IF(B246='2. Metadata'!D$1,'2. Metadata'!D$5, IF(B246='2. Metadata'!E$1,'2. Metadata'!E$5,IF( B246='2. Metadata'!F$1,'2. Metadata'!F$5,IF(B246='2. Metadata'!G$1,'2. Metadata'!G$5,IF(B246='2. Metadata'!H$1,'2. Metadata'!H$5, IF(B246='2. Metadata'!I$1,'2. Metadata'!I$5, IF(B246='2. Metadata'!J$1,'2. Metadata'!J$5, IF(B246='2. Metadata'!K$1,'2. Metadata'!K$5, IF(B246='2. Metadata'!L$1,'2. Metadata'!L$5, IF(B246='2. Metadata'!M$1,'2. Metadata'!M$5, IF(B246='2. Metadata'!N$1,'2. Metadata'!N$5))))))))))))))","v":49.97944},{"$f":"IF(ISBLANK(B246)=TRUE,\" \", IF(B246='2. Metadata'!B$1,'2. Metadata'!B$6, IF(B246='2. Metadata'!C$1,'2. Metadata'!C$6,IF(B246='2. Metadata'!D$1,'2. Metadata'!D$6, IF(B246='2. Metadata'!E$1,'2. Metadata'!E$6,IF( B246='2. Metadata'!F$1,'2. Metadata'!F$6,IF(B246='2. Metadata'!G$1,'2. Metadata'!G$6,IF(B246='2. Metadata'!H$1,'2. Metadata'!H$6, IF(B246='2. Metadata'!I$1,'2. Metadata'!I$6, IF(B246='2. Metadata'!J$1,'2. Metadata'!J$6, IF(B246='2. Metadata'!K$1,'2. Metadata'!K$6, IF(B246='2. Metadata'!L$1,'2. Metadata'!L$6, IF(B246='2. Metadata'!M$1,'2. Metadata'!M$6, IF(B246='2. Metadata'!N$1,'2. Metadata'!N$6))))))))))))))","v":-117.88417},"n/a",5.102,{"$f":"IF(ISBLANK(F246)=TRUE,\" \",'2. Metadata'!B$14)","v":"degrees Celsius"},2.343,{"$f":"IF(ISBLANK(H246)=TRUE,\" \",'2. Metadata'!B$26)","v":"degrees Celsius"},3.708,{"$f":"IF(ISBLANK(J246)=TRUE,\" \",'2. Metadata'!B$38)","v":"degrees Celsius"},"n/a"]
["2014-04-06","NECAR01",{"$f":"IF(ISBLANK(B247)=TRUE,\" \", IF(B247='2. Metadata'!B$1,'2. Metadata'!B$5, IF(B247='2. Metadata'!C$1,'2. Metadata'!C$5,IF(B247='2. Metadata'!D$1,'2. Metadata'!D$5, IF(B247='2. Metadata'!E$1,'2. Metadata'!E$5,IF( B247='2. Metadata'!F$1,'2. Metadata'!F$5,IF(B247='2. Metadata'!G$1,'2. Metadata'!G$5,IF(B247='2. Metadata'!H$1,'2. Metadata'!H$5, IF(B247='2. Metadata'!I$1,'2. Metadata'!I$5, IF(B247='2. Metadata'!J$1,'2. Metadata'!J$5, IF(B247='2. Metadata'!K$1,'2. Metadata'!K$5, IF(B247='2. Metadata'!L$1,'2. Metadata'!L$5, IF(B247='2. Metadata'!M$1,'2. Metadata'!M$5, IF(B247='2. Metadata'!N$1,'2. Metadata'!N$5))))))))))))))","v":49.97944},{"$f":"IF(ISBLANK(B247)=TRUE,\" \", IF(B247='2. Metadata'!B$1,'2. Metadata'!B$6, IF(B247='2. Metadata'!C$1,'2. Metadata'!C$6,IF(B247='2. Metadata'!D$1,'2. Metadata'!D$6, IF(B247='2. Metadata'!E$1,'2. Metadata'!E$6,IF( B247='2. Metadata'!F$1,'2. Metadata'!F$6,IF(B247='2. Metadata'!G$1,'2. Metadata'!G$6,IF(B247='2. Metadata'!H$1,'2. Metadata'!H$6, IF(B247='2. Metadata'!I$1,'2. Metadata'!I$6, IF(B247='2. Metadata'!J$1,'2. Metadata'!J$6, IF(B247='2. Metadata'!K$1,'2. Metadata'!K$6, IF(B247='2. Metadata'!L$1,'2. Metadata'!L$6, IF(B247='2. Metadata'!M$1,'2. Metadata'!M$6, IF(B247='2. Metadata'!N$1,'2. Metadata'!N$6))))))))))))))","v":-117.88417},"n/a",5.975,{"$f":"IF(ISBLANK(F247)=TRUE,\" \",'2. Metadata'!B$14)","v":"degrees Celsius"},3.195,{"$f":"IF(ISBLANK(H247)=TRUE,\" \",'2. Metadata'!B$26)","v":"degrees Celsius"},4.253,{"$f":"IF(ISBLANK(J247)=TRUE,\" \",'2. Metadata'!B$38)","v":"degrees Celsius"},"n/a"]
["2014-04-07","NECAR01",{"$f":"IF(ISBLANK(B248)=TRUE,\" \", IF(B248='2. Metadata'!B$1,'2. Metadata'!B$5, IF(B248='2. Metadata'!C$1,'2. Metadata'!C$5,IF(B248='2. Metadata'!D$1,'2. Metadata'!D$5, IF(B248='2. Metadata'!E$1,'2. Metadata'!E$5,IF( B248='2. Metadata'!F$1,'2. Metadata'!F$5,IF(B248='2. Metadata'!G$1,'2. Metadata'!G$5,IF(B248='2. Metadata'!H$1,'2. Metadata'!H$5, IF(B248='2. Metadata'!I$1,'2. Metadata'!I$5, IF(B248='2. Metadata'!J$1,'2. Metadata'!J$5, IF(B248='2. Metadata'!K$1,'2. Metadata'!K$5, IF(B248='2. Metadata'!L$1,'2. Metadata'!L$5, IF(B248='2. Metadata'!M$1,'2. Metadata'!M$5, IF(B248='2. Metadata'!N$1,'2. Metadata'!N$5))))))))))))))","v":49.97944},{"$f":"IF(ISBLANK(B248)=TRUE,\" \", IF(B248='2. Metadata'!B$1,'2. Metadata'!B$6, IF(B248='2. Metadata'!C$1,'2. Metadata'!C$6,IF(B248='2. Metadata'!D$1,'2. Metadata'!D$6, IF(B248='2. Metadata'!E$1,'2. Metadata'!E$6,IF( B248='2. Metadata'!F$1,'2. Metadata'!F$6,IF(B248='2. Metadata'!G$1,'2. Metadata'!G$6,IF(B248='2. Metadata'!H$1,'2. Metadata'!H$6, IF(B248='2. Metadata'!I$1,'2. Metadata'!I$6, IF(B248='2. Metadata'!J$1,'2. Metadata'!J$6, IF(B248='2. Metadata'!K$1,'2. Metadata'!K$6, IF(B248='2. Metadata'!L$1,'2. Metadata'!L$6, IF(B248='2. Metadata'!M$1,'2. Metadata'!M$6, IF(B248='2. Metadata'!N$1,'2. Metadata'!N$6))))))))))))))","v":-117.88417},"n/a",6.026,{"$f":"IF(ISBLANK(F248)=TRUE,\" \",'2. Metadata'!B$14)","v":"degrees Celsius"},3.009,{"$f":"IF(ISBLANK(H248)=TRUE,\" \",'2. Metadata'!B$26)","v":"degrees Celsius"},4.19,{"$f":"IF(ISBLANK(J248)=TRUE,\" \",'2. Metadata'!B$38)","v":"degrees Celsius"},"n/a"]
["2014-04-08","NECAR01",{"$f":"IF(ISBLANK(B249)=TRUE,\" \", IF(B249='2. Metadata'!B$1,'2. Metadata'!B$5, IF(B249='2. Metadata'!C$1,'2. Metadata'!C$5,IF(B249='2. Metadata'!D$1,'2. Metadata'!D$5, IF(B249='2. Metadata'!E$1,'2. Metadata'!E$5,IF( B249='2. Metadata'!F$1,'2. Metadata'!F$5,IF(B249='2. Metadata'!G$1,'2. Metadata'!G$5,IF(B249='2. Metadata'!H$1,'2. Metadata'!H$5, IF(B249='2. Metadata'!I$1,'2. Metadata'!I$5, IF(B249='2. Metadata'!J$1,'2. Metadata'!J$5, IF(B249='2. Metadata'!K$1,'2. Metadata'!K$5, IF(B249='2. Metadata'!L$1,'2. Metadata'!L$5, IF(B249='2. Metadata'!M$1,'2. Metadata'!M$5, IF(B249='2. Metadata'!N$1,'2. Metadata'!N$5))))))))))))))","v":49.97944},{"$f":"IF(ISBLANK(B249)=TRUE,\" \", IF(B249='2. Metadata'!B$1,'2. Metadata'!B$6, IF(B249='2. Metadata'!C$1,'2. Metadata'!C$6,IF(B249='2. Metadata'!D$1,'2. Metadata'!D$6, IF(B249='2. Metadata'!E$1,'2. Metadata'!E$6,IF( B249='2. Metadata'!F$1,'2. Metadata'!F$6,IF(B249='2. Metadata'!G$1,'2. Metadata'!G$6,IF(B249='2. Metadata'!H$1,'2. Metadata'!H$6, IF(B249='2. Metadata'!I$1,'2. Metadata'!I$6, IF(B249='2. Metadata'!J$1,'2. Metadata'!J$6, IF(B249='2. Metadata'!K$1,'2. Metadata'!K$6, IF(B249='2. Metadata'!L$1,'2. Metadata'!L$6, IF(B249='2. Metadata'!M$1,'2. Metadata'!M$6, IF(B249='2. Metadata'!N$1,'2. Metadata'!N$6))))))))))))))","v":-117.88417},"n/a",5.616,{"$f":"IF(ISBLANK(F249)=TRUE,\" \",'2. Metadata'!B$14)","v":"degrees Celsius"},2.823,{"$f":"IF(ISBLANK(H249)=TRUE,\" \",'2. Metadata'!B$26)","v":"degrees Celsius"},4.042,{"$f":"IF(ISBLANK(J249)=TRUE,\" \",'2. Metadata'!B$38)","v":"degrees Celsius"},"n/a"]
["2014-04-09","NECAR01",{"$f":"IF(ISBLANK(B250)=TRUE,\" \", IF(B250='2. Metadata'!B$1,'2. Metadata'!B$5, IF(B250='2. Metadata'!C$1,'2. Metadata'!C$5,IF(B250='2. Metadata'!D$1,'2. Metadata'!D$5, IF(B250='2. Metadata'!E$1,'2. Metadata'!E$5,IF( B250='2. Metadata'!F$1,'2. Metadata'!F$5,IF(B250='2. Metadata'!G$1,'2. Metadata'!G$5,IF(B250='2. Metadata'!H$1,'2. Metadata'!H$5, IF(B250='2. Metadata'!I$1,'2. Metadata'!I$5, IF(B250='2. Metadata'!J$1,'2. Metadata'!J$5, IF(B250='2. Metadata'!K$1,'2. Metadata'!K$5, IF(B250='2. Metadata'!L$1,'2. Metadata'!L$5, IF(B250='2. Metadata'!M$1,'2. Metadata'!M$5, IF(B250='2. Metadata'!N$1,'2. Metadata'!N$5))))))))))))))","v":49.97944},{"$f":"IF(ISBLANK(B250)=TRUE,\" \", IF(B250='2. Metadata'!B$1,'2. Metadata'!B$6, IF(B250='2. Metadata'!C$1,'2. Metadata'!C$6,IF(B250='2. Metadata'!D$1,'2. Metadata'!D$6, IF(B250='2. Metadata'!E$1,'2. Metadata'!E$6,IF( B250='2. Metadata'!F$1,'2. Metadata'!F$6,IF(B250='2. Metadata'!G$1,'2. Metadata'!G$6,IF(B250='2. Metadata'!H$1,'2. Metadata'!H$6, IF(B250='2. Metadata'!I$1,'2. Metadata'!I$6, IF(B250='2. Metadata'!J$1,'2. Metadata'!J$6, IF(B250='2. Metadata'!K$1,'2. Metadata'!K$6, IF(B250='2. Metadata'!L$1,'2. Metadata'!L$6, IF(B250='2. Metadata'!M$1,'2. Metadata'!M$6, IF(B250='2. Metadata'!N$1,'2. Metadata'!N$6))))))))))))))","v":-117.88417},"n/a",5.719,{"$f":"IF(ISBLANK(F250)=TRUE,\" \",'2. Metadata'!B$14)","v":"degrees Celsius"},2.956,{"$f":"IF(ISBLANK(H250)=TRUE,\" \",'2. Metadata'!B$26)","v":"degrees Celsius"},4.011,{"$f":"IF(ISBLANK(J250)=TRUE,\" \",'2. Metadata'!B$38)","v":"degrees Celsius"},"n/a"]
["2014-04-10","NECAR01",{"$f":"IF(ISBLANK(B251)=TRUE,\" \", IF(B251='2. Metadata'!B$1,'2. Metadata'!B$5, IF(B251='2. Metadata'!C$1,'2. Metadata'!C$5,IF(B251='2. Metadata'!D$1,'2. Metadata'!D$5, IF(B251='2. Metadata'!E$1,'2. Metadata'!E$5,IF( B251='2. Metadata'!F$1,'2. Metadata'!F$5,IF(B251='2. Metadata'!G$1,'2. Metadata'!G$5,IF(B251='2. Metadata'!H$1,'2. Metadata'!H$5, IF(B251='2. Metadata'!I$1,'2. Metadata'!I$5, IF(B251='2. Metadata'!J$1,'2. Metadata'!J$5, IF(B251='2. Metadata'!K$1,'2. Metadata'!K$5, IF(B251='2. Metadata'!L$1,'2. Metadata'!L$5, IF(B251='2. Metadata'!M$1,'2. Metadata'!M$5, IF(B251='2. Metadata'!N$1,'2. Metadata'!N$5))))))))))))))","v":49.97944},{"$f":"IF(ISBLANK(B251)=TRUE,\" \", IF(B251='2. Metadata'!B$1,'2. Metadata'!B$6, IF(B251='2. Metadata'!C$1,'2. Metadata'!C$6,IF(B251='2. Metadata'!D$1,'2. Metadata'!D$6, IF(B251='2. Metadata'!E$1,'2. Metadata'!E$6,IF( B251='2. Metadata'!F$1,'2. Metadata'!F$6,IF(B251='2. Metadata'!G$1,'2. Metadata'!G$6,IF(B251='2. Metadata'!H$1,'2. Metadata'!H$6, IF(B251='2. Metadata'!I$1,'2. Metadata'!I$6, IF(B251='2. Metadata'!J$1,'2. Metadata'!J$6, IF(B251='2. Metadata'!K$1,'2. Metadata'!K$6, IF(B251='2. Metadata'!L$1,'2. Metadata'!L$6, IF(B251='2. Metadata'!M$1,'2. Metadata'!M$6, IF(B251='2. Metadata'!N$1,'2. Metadata'!N$6))))))))))))))","v":-117.88417},"n/a",6.408,{"$f":"IF(ISBLANK(F251)=TRUE,\" \",'2. Metadata'!B$14)","v":"degrees Celsius"},2.316,{"$f":"IF(ISBLANK(H251)=TRUE,\" \",'2. Metadata'!B$26)","v":"degrees Celsius"},3.973,{"$f":"IF(ISBLANK(J251)=TRUE,\" \",'2. Metadata'!B$38)","v":"degrees Celsius"},"n/a"]
["2014-04-11","NECAR01",{"$f":"IF(ISBLANK(B252)=TRUE,\" \", IF(B252='2. Metadata'!B$1,'2. Metadata'!B$5, IF(B252='2. Metadata'!C$1,'2. Metadata'!C$5,IF(B252='2. Metadata'!D$1,'2. Metadata'!D$5, IF(B252='2. Metadata'!E$1,'2. Metadata'!E$5,IF( B252='2. Metadata'!F$1,'2. Metadata'!F$5,IF(B252='2. Metadata'!G$1,'2. Metadata'!G$5,IF(B252='2. Metadata'!H$1,'2. Metadata'!H$5, IF(B252='2. Metadata'!I$1,'2. Metadata'!I$5, IF(B252='2. Metadata'!J$1,'2. Metadata'!J$5, IF(B252='2. Metadata'!K$1,'2. Metadata'!K$5, IF(B252='2. Metadata'!L$1,'2. Metadata'!L$5, IF(B252='2. Metadata'!M$1,'2. Metadata'!M$5, IF(B252='2. Metadata'!N$1,'2. Metadata'!N$5))))))))))))))","v":49.97944},{"$f":"IF(ISBLANK(B252)=TRUE,\" \", IF(B252='2. Metadata'!B$1,'2. Metadata'!B$6, IF(B252='2. Metadata'!C$1,'2. Metadata'!C$6,IF(B252='2. Metadata'!D$1,'2. Metadata'!D$6, IF(B252='2. Metadata'!E$1,'2. Metadata'!E$6,IF( B252='2. Metadata'!F$1,'2. Metadata'!F$6,IF(B252='2. Metadata'!G$1,'2. Metadata'!G$6,IF(B252='2. Metadata'!H$1,'2. Metadata'!H$6, IF(B252='2. Metadata'!I$1,'2. Metadata'!I$6, IF(B252='2. Metadata'!J$1,'2. Metadata'!J$6, IF(B252='2. Metadata'!K$1,'2. Metadata'!K$6, IF(B252='2. Metadata'!L$1,'2. Metadata'!L$6, IF(B252='2. Metadata'!M$1,'2. Metadata'!M$6, IF(B252='2. Metadata'!N$1,'2. Metadata'!N$6))))))))))))))","v":-117.88417},"n/a",5.102,{"$f":"IF(ISBLANK(F252)=TRUE,\" \",'2. Metadata'!B$14)","v":"degrees Celsius"},3.38,{"$f":"IF(ISBLANK(H252)=TRUE,\" \",'2. Metadata'!B$26)","v":"degrees Celsius"},3.937,{"$f":"IF(ISBLANK(J252)=TRUE,\" \",'2. Metadata'!B$38)","v":"degrees Celsius"},"n/a"]
["2014-04-12","NECAR01",{"$f":"IF(ISBLANK(B253)=TRUE,\" \", IF(B253='2. Metadata'!B$1,'2. Metadata'!B$5, IF(B253='2. Metadata'!C$1,'2. Metadata'!C$5,IF(B253='2. Metadata'!D$1,'2. Metadata'!D$5, IF(B253='2. Metadata'!E$1,'2. Metadata'!E$5,IF( B253='2. Metadata'!F$1,'2. Metadata'!F$5,IF(B253='2. Metadata'!G$1,'2. Metadata'!G$5,IF(B253='2. Metadata'!H$1,'2. Metadata'!H$5, IF(B253='2. Metadata'!I$1,'2. Metadata'!I$5, IF(B253='2. Metadata'!J$1,'2. Metadata'!J$5, IF(B253='2. Metadata'!K$1,'2. Metadata'!K$5, IF(B253='2. Metadata'!L$1,'2. Metadata'!L$5, IF(B253='2. Metadata'!M$1,'2. Metadata'!M$5, IF(B253='2. Metadata'!N$1,'2. Metadata'!N$5))))))))))))))","v":49.97944},{"$f":"IF(ISBLANK(B253)=TRUE,\" \", IF(B253='2. Metadata'!B$1,'2. Metadata'!B$6, IF(B253='2. Metadata'!C$1,'2. Metadata'!C$6,IF(B253='2. Metadata'!D$1,'2. Metadata'!D$6, IF(B253='2. Metadata'!E$1,'2. Metadata'!E$6,IF( B253='2. Metadata'!F$1,'2. Metadata'!F$6,IF(B253='2. Metadata'!G$1,'2. Metadata'!G$6,IF(B253='2. Metadata'!H$1,'2. Metadata'!H$6, IF(B253='2. Metadata'!I$1,'2. Metadata'!I$6, IF(B253='2. Metadata'!J$1,'2. Metadata'!J$6, IF(B253='2. Metadata'!K$1,'2. Metadata'!K$6, IF(B253='2. Metadata'!L$1,'2. Metadata'!L$6, IF(B253='2. Metadata'!M$1,'2. Metadata'!M$6, IF(B253='2. Metadata'!N$1,'2. Metadata'!N$6))))))))))))))","v":-117.88417},"n/a",5.975,{"$f":"IF(ISBLANK(F253)=TRUE,\" \",'2. Metadata'!B$14)","v":"degrees Celsius"},2.903,{"$f":"IF(ISBLANK(H253)=TRUE,\" \",'2. Metadata'!B$26)","v":"degrees Celsius"},4.075,{"$f":"IF(ISBLANK(J253)=TRUE,\" \",'2. Metadata'!B$38)","v":"degrees Celsius"},"n/a"]
["2014-04-13","NECAR01",{"$f":"IF(ISBLANK(B254)=TRUE,\" \", IF(B254='2. Metadata'!B$1,'2. Metadata'!B$5, IF(B254='2. Metadata'!C$1,'2. Metadata'!C$5,IF(B254='2. Metadata'!D$1,'2. Metadata'!D$5, IF(B254='2. Metadata'!E$1,'2. Metadata'!E$5,IF( B254='2. Metadata'!F$1,'2. Metadata'!F$5,IF(B254='2. Metadata'!G$1,'2. Metadata'!G$5,IF(B254='2. Metadata'!H$1,'2. Metadata'!H$5, IF(B254='2. Metadata'!I$1,'2. Metadata'!I$5, IF(B254='2. Metadata'!J$1,'2. Metadata'!J$5, IF(B254='2. Metadata'!K$1,'2. Metadata'!K$5, IF(B254='2. Metadata'!L$1,'2. Metadata'!L$5, IF(B254='2. Metadata'!M$1,'2. Metadata'!M$5, IF(B254='2. Metadata'!N$1,'2. Metadata'!N$5))))))))))))))","v":49.97944},{"$f":"IF(ISBLANK(B254)=TRUE,\" \", IF(B254='2. Metadata'!B$1,'2. Metadata'!B$6, IF(B254='2. Metadata'!C$1,'2. Metadata'!C$6,IF(B254='2. Metadata'!D$1,'2. Metadata'!D$6, IF(B254='2. Metadata'!E$1,'2. Metadata'!E$6,IF( B254='2. Metadata'!F$1,'2. Metadata'!F$6,IF(B254='2. Metadata'!G$1,'2. Metadata'!G$6,IF(B254='2. Metadata'!H$1,'2. Metadata'!H$6, IF(B254='2. Metadata'!I$1,'2. Metadata'!I$6, IF(B254='2. Metadata'!J$1,'2. Metadata'!J$6, IF(B254='2. Metadata'!K$1,'2. Metadata'!K$6, IF(B254='2. Metadata'!L$1,'2. Metadata'!L$6, IF(B254='2. Metadata'!M$1,'2. Metadata'!M$6, IF(B254='2. Metadata'!N$1,'2. Metadata'!N$6))))))))))))))","v":-117.88417},"n/a",6.484,{"$f":"IF(ISBLANK(F254)=TRUE,\" \",'2. Metadata'!B$14)","v":"degrees Celsius"},2.396,{"$f":"IF(ISBLANK(H254)=TRUE,\" \",'2. Metadata'!B$26)","v":"degrees Celsius"},4.076,{"$f":"IF(ISBLANK(J254)=TRUE,\" \",'2. Metadata'!B$38)","v":"degrees Celsius"},"n/a"]
["2014-04-14","NECAR01",{"$f":"IF(ISBLANK(B255)=TRUE,\" \", IF(B255='2. Metadata'!B$1,'2. Metadata'!B$5, IF(B255='2. Metadata'!C$1,'2. Metadata'!C$5,IF(B255='2. Metadata'!D$1,'2. Metadata'!D$5, IF(B255='2. Metadata'!E$1,'2. Metadata'!E$5,IF( B255='2. Metadata'!F$1,'2. Metadata'!F$5,IF(B255='2. Metadata'!G$1,'2. Metadata'!G$5,IF(B255='2. Metadata'!H$1,'2. Metadata'!H$5, IF(B255='2. Metadata'!I$1,'2. Metadata'!I$5, IF(B255='2. Metadata'!J$1,'2. Metadata'!J$5, IF(B255='2. Metadata'!K$1,'2. Metadata'!K$5, IF(B255='2. Metadata'!L$1,'2. Metadata'!L$5, IF(B255='2. Metadata'!M$1,'2. Metadata'!M$5, IF(B255='2. Metadata'!N$1,'2. Metadata'!N$5))))))))))))))","v":49.97944},{"$f":"IF(ISBLANK(B255)=TRUE,\" \", IF(B255='2. Metadata'!B$1,'2. Metadata'!B$6, IF(B255='2. Metadata'!C$1,'2. Metadata'!C$6,IF(B255='2. Metadata'!D$1,'2. Metadata'!D$6, IF(B255='2. Metadata'!E$1,'2. Metadata'!E$6,IF( B255='2. Metadata'!F$1,'2. Metadata'!F$6,IF(B255='2. Metadata'!G$1,'2. Metadata'!G$6,IF(B255='2. Metadata'!H$1,'2. Metadata'!H$6, IF(B255='2. Metadata'!I$1,'2. Metadata'!I$6, IF(B255='2. Metadata'!J$1,'2. Metadata'!J$6, IF(B255='2. Metadata'!K$1,'2. Metadata'!K$6, IF(B255='2. Metadata'!L$1,'2. Metadata'!L$6, IF(B255='2. Metadata'!M$1,'2. Metadata'!M$6, IF(B255='2. Metadata'!N$1,'2. Metadata'!N$6))))))))))))))","v":-117.88417},"n/a",6.23,{"$f":"IF(ISBLANK(F255)=TRUE,\" \",'2. Metadata'!B$14)","v":"degrees Celsius"},2.396,{"$f":"IF(ISBLANK(H255)=TRUE,\" \",'2. Metadata'!B$26)","v":"degrees Celsius"},4.139,{"$f":"IF(ISBLANK(J255)=TRUE,\" \",'2. Metadata'!B$38)","v":"degrees Celsius"},"n/a"]
["2014-04-15","NECAR01",{"$f":"IF(ISBLANK(B256)=TRUE,\" \", IF(B256='2. Metadata'!B$1,'2. Metadata'!B$5, IF(B256='2. Metadata'!C$1,'2. Metadata'!C$5,IF(B256='2. Metadata'!D$1,'2. Metadata'!D$5, IF(B256='2. Metadata'!E$1,'2. Metadata'!E$5,IF( B256='2. Metadata'!F$1,'2. Metadata'!F$5,IF(B256='2. Metadata'!G$1,'2. Metadata'!G$5,IF(B256='2. Metadata'!H$1,'2. Metadata'!H$5, IF(B256='2. Metadata'!I$1,'2. Metadata'!I$5, IF(B256='2. Metadata'!J$1,'2. Metadata'!J$5, IF(B256='2. Metadata'!K$1,'2. Metadata'!K$5, IF(B256='2. Metadata'!L$1,'2. Metadata'!L$5, IF(B256='2. Metadata'!M$1,'2. Metadata'!M$5, IF(B256='2. Metadata'!N$1,'2. Metadata'!N$5))))))))))))))","v":49.97944},{"$f":"IF(ISBLANK(B256)=TRUE,\" \", IF(B256='2. Metadata'!B$1,'2. Metadata'!B$6, IF(B256='2. Metadata'!C$1,'2. Metadata'!C$6,IF(B256='2. Metadata'!D$1,'2. Metadata'!D$6, IF(B256='2. Metadata'!E$1,'2. Metadata'!E$6,IF( B256='2. Metadata'!F$1,'2. Metadata'!F$6,IF(B256='2. Metadata'!G$1,'2. Metadata'!G$6,IF(B256='2. Metadata'!H$1,'2. Metadata'!H$6, IF(B256='2. Metadata'!I$1,'2. Metadata'!I$6, IF(B256='2. Metadata'!J$1,'2. Metadata'!J$6, IF(B256='2. Metadata'!K$1,'2. Metadata'!K$6, IF(B256='2. Metadata'!L$1,'2. Metadata'!L$6, IF(B256='2. Metadata'!M$1,'2. Metadata'!M$6, IF(B256='2. Metadata'!N$1,'2. Metadata'!N$6))))))))))))))","v":-117.88417},"n/a",5.898,{"$f":"IF(ISBLANK(F256)=TRUE,\" \",'2. Metadata'!B$14)","v":"degrees Celsius"},3.564,{"$f":"IF(ISBLANK(H256)=TRUE,\" \",'2. Metadata'!B$26)","v":"degrees Celsius"},4.518,{"$f":"IF(ISBLANK(J256)=TRUE,\" \",'2. Metadata'!B$38)","v":"degrees Celsius"},"n/a"]
["2014-04-16","NECAR01",{"$f":"IF(ISBLANK(B257)=TRUE,\" \", IF(B257='2. Metadata'!B$1,'2. Metadata'!B$5, IF(B257='2. Metadata'!C$1,'2. Metadata'!C$5,IF(B257='2. Metadata'!D$1,'2. Metadata'!D$5, IF(B257='2. Metadata'!E$1,'2. Metadata'!E$5,IF( B257='2. Metadata'!F$1,'2. Metadata'!F$5,IF(B257='2. Metadata'!G$1,'2. Metadata'!G$5,IF(B257='2. Metadata'!H$1,'2. Metadata'!H$5, IF(B257='2. Metadata'!I$1,'2. Metadata'!I$5, IF(B257='2. Metadata'!J$1,'2. Metadata'!J$5, IF(B257='2. Metadata'!K$1,'2. Metadata'!K$5, IF(B257='2. Metadata'!L$1,'2. Metadata'!L$5, IF(B257='2. Metadata'!M$1,'2. Metadata'!M$5, IF(B257='2. Metadata'!N$1,'2. Metadata'!N$5))))))))))))))","v":49.97944},{"$f":"IF(ISBLANK(B257)=TRUE,\" \", IF(B257='2. Metadata'!B$1,'2. Metadata'!B$6, IF(B257='2. Metadata'!C$1,'2. Metadata'!C$6,IF(B257='2. Metadata'!D$1,'2. Metadata'!D$6, IF(B257='2. Metadata'!E$1,'2. Metadata'!E$6,IF( B257='2. Metadata'!F$1,'2. Metadata'!F$6,IF(B257='2. Metadata'!G$1,'2. Metadata'!G$6,IF(B257='2. Metadata'!H$1,'2. Metadata'!H$6, IF(B257='2. Metadata'!I$1,'2. Metadata'!I$6, IF(B257='2. Metadata'!J$1,'2. Metadata'!J$6, IF(B257='2. Metadata'!K$1,'2. Metadata'!K$6, IF(B257='2. Metadata'!L$1,'2. Metadata'!L$6, IF(B257='2. Metadata'!M$1,'2. Metadata'!M$6, IF(B257='2. Metadata'!N$1,'2. Metadata'!N$6))))))))))))))","v":-117.88417},"n/a",5.616,{"$f":"IF(ISBLANK(F257)=TRUE,\" \",'2. Metadata'!B$14)","v":"degrees Celsius"},3.221,{"$f":"IF(ISBLANK(H257)=TRUE,\" \",'2. Metadata'!B$26)","v":"degrees Celsius"},4.335,{"$f":"IF(ISBLANK(J257)=TRUE,\" \",'2. Metadata'!B$38)","v":"degrees Celsius"},"n/a"]
["2014-04-17","NECAR01",{"$f":"IF(ISBLANK(B258)=TRUE,\" \", IF(B258='2. Metadata'!B$1,'2. Metadata'!B$5, IF(B258='2. Metadata'!C$1,'2. Metadata'!C$5,IF(B258='2. Metadata'!D$1,'2. Metadata'!D$5, IF(B258='2. Metadata'!E$1,'2. Metadata'!E$5,IF( B258='2. Metadata'!F$1,'2. Metadata'!F$5,IF(B258='2. Metadata'!G$1,'2. Metadata'!G$5,IF(B258='2. Metadata'!H$1,'2. Metadata'!H$5, IF(B258='2. Metadata'!I$1,'2. Metadata'!I$5, IF(B258='2. Metadata'!J$1,'2. Metadata'!J$5, IF(B258='2. Metadata'!K$1,'2. Metadata'!K$5, IF(B258='2. Metadata'!L$1,'2. Metadata'!L$5, IF(B258='2. Metadata'!M$1,'2. Metadata'!M$5, IF(B258='2. Metadata'!N$1,'2. Metadata'!N$5))))))))))))))","v":49.97944},{"$f":"IF(ISBLANK(B258)=TRUE,\" \", IF(B258='2. Metadata'!B$1,'2. Metadata'!B$6, IF(B258='2. Metadata'!C$1,'2. Metadata'!C$6,IF(B258='2. Metadata'!D$1,'2. Metadata'!D$6, IF(B258='2. Metadata'!E$1,'2. Metadata'!E$6,IF( B258='2. Metadata'!F$1,'2. Metadata'!F$6,IF(B258='2. Metadata'!G$1,'2. Metadata'!G$6,IF(B258='2. Metadata'!H$1,'2. Metadata'!H$6, IF(B258='2. Metadata'!I$1,'2. Metadata'!I$6, IF(B258='2. Metadata'!J$1,'2. Metadata'!J$6, IF(B258='2. Metadata'!K$1,'2. Metadata'!K$6, IF(B258='2. Metadata'!L$1,'2. Metadata'!L$6, IF(B258='2. Metadata'!M$1,'2. Metadata'!M$6, IF(B258='2. Metadata'!N$1,'2. Metadata'!N$6))))))))))))))","v":-117.88417},"n/a",6.026,{"$f":"IF(ISBLANK(F258)=TRUE,\" \",'2. Metadata'!B$14)","v":"degrees Celsius"},3.854,{"$f":"IF(ISBLANK(H258)=TRUE,\" \",'2. Metadata'!B$26)","v":"degrees Celsius"},4.666,{"$f":"IF(ISBLANK(J258)=TRUE,\" \",'2. Metadata'!B$38)","v":"degrees Celsius"},"n/a"]
["2014-04-18","NECAR01",{"$f":"IF(ISBLANK(B259)=TRUE,\" \", IF(B259='2. Metadata'!B$1,'2. Metadata'!B$5, IF(B259='2. Metadata'!C$1,'2. Metadata'!C$5,IF(B259='2. Metadata'!D$1,'2. Metadata'!D$5, IF(B259='2. Metadata'!E$1,'2. Metadata'!E$5,IF( B259='2. Metadata'!F$1,'2. Metadata'!F$5,IF(B259='2. Metadata'!G$1,'2. Metadata'!G$5,IF(B259='2. Metadata'!H$1,'2. Metadata'!H$5, IF(B259='2. Metadata'!I$1,'2. Metadata'!I$5, IF(B259='2. Metadata'!J$1,'2. Metadata'!J$5, IF(B259='2. Metadata'!K$1,'2. Metadata'!K$5, IF(B259='2. Metadata'!L$1,'2. Metadata'!L$5, IF(B259='2. Metadata'!M$1,'2. Metadata'!M$5, IF(B259='2. Metadata'!N$1,'2. Metadata'!N$5))))))))))))))","v":49.97944},{"$f":"IF(ISBLANK(B259)=TRUE,\" \", IF(B259='2. Metadata'!B$1,'2. Metadata'!B$6, IF(B259='2. Metadata'!C$1,'2. Metadata'!C$6,IF(B259='2. Metadata'!D$1,'2. Metadata'!D$6, IF(B259='2. Metadata'!E$1,'2. Metadata'!E$6,IF( B259='2. Metadata'!F$1,'2. Metadata'!F$6,IF(B259='2. Metadata'!G$1,'2. Metadata'!G$6,IF(B259='2. Metadata'!H$1,'2. Metadata'!H$6, IF(B259='2. Metadata'!I$1,'2. Metadata'!I$6, IF(B259='2. Metadata'!J$1,'2. Metadata'!J$6, IF(B259='2. Metadata'!K$1,'2. Metadata'!K$6, IF(B259='2. Metadata'!L$1,'2. Metadata'!L$6, IF(B259='2. Metadata'!M$1,'2. Metadata'!M$6, IF(B259='2. Metadata'!N$1,'2. Metadata'!N$6))))))))))))))","v":-117.88417},"n/a",4.584,{"$f":"IF(ISBLANK(F259)=TRUE,\" \",'2. Metadata'!B$14)","v":"degrees Celsius"},3.538,{"$f":"IF(ISBLANK(H259)=TRUE,\" \",'2. Metadata'!B$26)","v":"degrees Celsius"},4.1,{"$f":"IF(ISBLANK(J259)=TRUE,\" \",'2. Metadata'!B$38)","v":"degrees Celsius"},"n/a"]
["2014-04-19","NECAR01",{"$f":"IF(ISBLANK(B260)=TRUE,\" \", IF(B260='2. Metadata'!B$1,'2. Metadata'!B$5, IF(B260='2. Metadata'!C$1,'2. Metadata'!C$5,IF(B260='2. Metadata'!D$1,'2. Metadata'!D$5, IF(B260='2. Metadata'!E$1,'2. Metadata'!E$5,IF( B260='2. Metadata'!F$1,'2. Metadata'!F$5,IF(B260='2. Metadata'!G$1,'2. Metadata'!G$5,IF(B260='2. Metadata'!H$1,'2. Metadata'!H$5, IF(B260='2. Metadata'!I$1,'2. Metadata'!I$5, IF(B260='2. Metadata'!J$1,'2. Metadata'!J$5, IF(B260='2. Metadata'!K$1,'2. Metadata'!K$5, IF(B260='2. Metadata'!L$1,'2. Metadata'!L$5, IF(B260='2. Metadata'!M$1,'2. Metadata'!M$5, IF(B260='2. Metadata'!N$1,'2. Metadata'!N$5))))))))))))))","v":49.97944},{"$f":"IF(ISBLANK(B260)=TRUE,\" \", IF(B260='2. Metadata'!B$1,'2. Metadata'!B$6, IF(B260='2. Metadata'!C$1,'2. Metadata'!C$6,IF(B260='2. Metadata'!D$1,'2. Metadata'!D$6, IF(B260='2. Metadata'!E$1,'2. Metadata'!E$6,IF( B260='2. Metadata'!F$1,'2. Metadata'!F$6,IF(B260='2. Metadata'!G$1,'2. Metadata'!G$6,IF(B260='2. Metadata'!H$1,'2. Metadata'!H$6, IF(B260='2. Metadata'!I$1,'2. Metadata'!I$6, IF(B260='2. Metadata'!J$1,'2. Metadata'!J$6, IF(B260='2. Metadata'!K$1,'2. Metadata'!K$6, IF(B260='2. Metadata'!L$1,'2. Metadata'!L$6, IF(B260='2. Metadata'!M$1,'2. Metadata'!M$6, IF(B260='2. Metadata'!N$1,'2. Metadata'!N$6))))))))))))))","v":-117.88417},"n/a",5.565,{"$f":"IF(ISBLANK(F260)=TRUE,\" \",'2. Metadata'!B$14)","v":"degrees Celsius"},2.797,{"$f":"IF(ISBLANK(H260)=TRUE,\" \",'2. Metadata'!B$26)","v":"degrees Celsius"},4.108,{"$f":"IF(ISBLANK(J260)=TRUE,\" \",'2. Metadata'!B$38)","v":"degrees Celsius"},"n/a"]
["2014-04-20","NECAR01",{"$f":"IF(ISBLANK(B261)=TRUE,\" \", IF(B261='2. Metadata'!B$1,'2. Metadata'!B$5, IF(B261='2. Metadata'!C$1,'2. Metadata'!C$5,IF(B261='2. Metadata'!D$1,'2. Metadata'!D$5, IF(B261='2. Metadata'!E$1,'2. Metadata'!E$5,IF( B261='2. Metadata'!F$1,'2. Metadata'!F$5,IF(B261='2. Metadata'!G$1,'2. Metadata'!G$5,IF(B261='2. Metadata'!H$1,'2. Metadata'!H$5, IF(B261='2. Metadata'!I$1,'2. Metadata'!I$5, IF(B261='2. Metadata'!J$1,'2. Metadata'!J$5, IF(B261='2. Metadata'!K$1,'2. Metadata'!K$5, IF(B261='2. Metadata'!L$1,'2. Metadata'!L$5, IF(B261='2. Metadata'!M$1,'2. Metadata'!M$5, IF(B261='2. Metadata'!N$1,'2. Metadata'!N$5))))))))))))))","v":49.97944},{"$f":"IF(ISBLANK(B261)=TRUE,\" \", IF(B261='2. Metadata'!B$1,'2. Metadata'!B$6, IF(B261='2. Metadata'!C$1,'2. Metadata'!C$6,IF(B261='2. Metadata'!D$1,'2. Metadata'!D$6, IF(B261='2. Metadata'!E$1,'2. Metadata'!E$6,IF( B261='2. Metadata'!F$1,'2. Metadata'!F$6,IF(B261='2. Metadata'!G$1,'2. Metadata'!G$6,IF(B261='2. Metadata'!H$1,'2. Metadata'!H$6, IF(B261='2. Metadata'!I$1,'2. Metadata'!I$6, IF(B261='2. Metadata'!J$1,'2. Metadata'!J$6, IF(B261='2. Metadata'!K$1,'2. Metadata'!K$6, IF(B261='2. Metadata'!L$1,'2. Metadata'!L$6, IF(B261='2. Metadata'!M$1,'2. Metadata'!M$6, IF(B261='2. Metadata'!N$1,'2. Metadata'!N$6))))))))))))))","v":-117.88417},"n/a",6.611,{"$f":"IF(ISBLANK(F261)=TRUE,\" \",'2. Metadata'!B$14)","v":"degrees Celsius"},3.722,{"$f":"IF(ISBLANK(H261)=TRUE,\" \",'2. Metadata'!B$26)","v":"degrees Celsius"},4.888,{"$f":"IF(ISBLANK(J261)=TRUE,\" \",'2. Metadata'!B$38)","v":"degrees Celsius"},"n/a"]
["2014-04-21","NECAR01",{"$f":"IF(ISBLANK(B262)=TRUE,\" \", IF(B262='2. Metadata'!B$1,'2. Metadata'!B$5, IF(B262='2. Metadata'!C$1,'2. Metadata'!C$5,IF(B262='2. Metadata'!D$1,'2. Metadata'!D$5, IF(B262='2. Metadata'!E$1,'2. Metadata'!E$5,IF( B262='2. Metadata'!F$1,'2. Metadata'!F$5,IF(B262='2. Metadata'!G$1,'2. Metadata'!G$5,IF(B262='2. Metadata'!H$1,'2. Metadata'!H$5, IF(B262='2. Metadata'!I$1,'2. Metadata'!I$5, IF(B262='2. Metadata'!J$1,'2. Metadata'!J$5, IF(B262='2. Metadata'!K$1,'2. Metadata'!K$5, IF(B262='2. Metadata'!L$1,'2. Metadata'!L$5, IF(B262='2. Metadata'!M$1,'2. Metadata'!M$5, IF(B262='2. Metadata'!N$1,'2. Metadata'!N$5))))))))))))))","v":49.97944},{"$f":"IF(ISBLANK(B262)=TRUE,\" \", IF(B262='2. Metadata'!B$1,'2. Metadata'!B$6, IF(B262='2. Metadata'!C$1,'2. Metadata'!C$6,IF(B262='2. Metadata'!D$1,'2. Metadata'!D$6, IF(B262='2. Metadata'!E$1,'2. Metadata'!E$6,IF( B262='2. Metadata'!F$1,'2. Metadata'!F$6,IF(B262='2. Metadata'!G$1,'2. Metadata'!G$6,IF(B262='2. Metadata'!H$1,'2. Metadata'!H$6, IF(B262='2. Metadata'!I$1,'2. Metadata'!I$6, IF(B262='2. Metadata'!J$1,'2. Metadata'!J$6, IF(B262='2. Metadata'!K$1,'2. Metadata'!K$6, IF(B262='2. Metadata'!L$1,'2. Metadata'!L$6, IF(B262='2. Metadata'!M$1,'2. Metadata'!M$6, IF(B262='2. Metadata'!N$1,'2. Metadata'!N$6))))))))))))))","v":-117.88417},"n/a",5.205,{"$f":"IF(ISBLANK(F262)=TRUE,\" \",'2. Metadata'!B$14)","v":"degrees Celsius"},3.591,{"$f":"IF(ISBLANK(H262)=TRUE,\" \",'2. Metadata'!B$26)","v":"degrees Celsius"},4.385,{"$f":"IF(ISBLANK(J262)=TRUE,\" \",'2. Metadata'!B$38)","v":"degrees Celsius"},"n/a"]
["2014-04-22","NECAR01",{"$f":"IF(ISBLANK(B263)=TRUE,\" \", IF(B263='2. Metadata'!B$1,'2. Metadata'!B$5, IF(B263='2. Metadata'!C$1,'2. Metadata'!C$5,IF(B263='2. Metadata'!D$1,'2. Metadata'!D$5, IF(B263='2. Metadata'!E$1,'2. Metadata'!E$5,IF( B263='2. Metadata'!F$1,'2. Metadata'!F$5,IF(B263='2. Metadata'!G$1,'2. Metadata'!G$5,IF(B263='2. Metadata'!H$1,'2. Metadata'!H$5, IF(B263='2. Metadata'!I$1,'2. Metadata'!I$5, IF(B263='2. Metadata'!J$1,'2. Metadata'!J$5, IF(B263='2. Metadata'!K$1,'2. Metadata'!K$5, IF(B263='2. Metadata'!L$1,'2. Metadata'!L$5, IF(B263='2. Metadata'!M$1,'2. Metadata'!M$5, IF(B263='2. Metadata'!N$1,'2. Metadata'!N$5))))))))))))))","v":49.97944},{"$f":"IF(ISBLANK(B263)=TRUE,\" \", IF(B263='2. Metadata'!B$1,'2. Metadata'!B$6, IF(B263='2. Metadata'!C$1,'2. Metadata'!C$6,IF(B263='2. Metadata'!D$1,'2. Metadata'!D$6, IF(B263='2. Metadata'!E$1,'2. Metadata'!E$6,IF( B263='2. Metadata'!F$1,'2. Metadata'!F$6,IF(B263='2. Metadata'!G$1,'2. Metadata'!G$6,IF(B263='2. Metadata'!H$1,'2. Metadata'!H$6, IF(B263='2. Metadata'!I$1,'2. Metadata'!I$6, IF(B263='2. Metadata'!J$1,'2. Metadata'!J$6, IF(B263='2. Metadata'!K$1,'2. Metadata'!K$6, IF(B263='2. Metadata'!L$1,'2. Metadata'!L$6, IF(B263='2. Metadata'!M$1,'2. Metadata'!M$6, IF(B263='2. Metadata'!N$1,'2. Metadata'!N$6))))))))))))))","v":-117.88417},"n/a",4.584,{"$f":"IF(ISBLANK(F263)=TRUE,\" \",'2. Metadata'!B$14)","v":"degrees Celsius"},3.854,{"$f":"IF(ISBLANK(H263)=TRUE,\" \",'2. Metadata'!B$26)","v":"degrees Celsius"},4.113,{"$f":"IF(ISBLANK(J263)=TRUE,\" \",'2. Metadata'!B$38)","v":"degrees Celsius"},"n/a"]

{"sheet":"2. Metadata","index":1,"n_rows":48,"n_cols":2,"rows_kept":48}
["Site ID","NECAR01"]
["Location/Site Name","Caribou Ck. Site 1"]
["Waterbody Type","Streams"]
["Waterbody","Caribou Creek"]
["Site Latitude (decimal degrees)",49.97944]
["Site Longitude (decimal degrees)",-117.88417]
["Coordinate System","WGS84"]
["Site Elevation (masl)",1450]
["Measurement Interval","Daily"]
["Site Notes","N/A"]
["Site Photos in Dataset","No"]
["Photo Resource Name","N/A"]
["Parameter 1","maxiumum_water_temperature"]
["Unit of Measurement","degrees Celsius"]
["Instrument Type","Data Logger"]
["Instrument Manufacturer","Unknown"]
["Instrument Model","Unknown"]
["Serial Number","Unknown"]
["Range","Unknown"]
["Accuracy","Unknown"]
["Resolution","Unknown"]
["Calibration Notes","Unknown"]
["Time Zone","PT"]
["Notes on Methods","N/A"]
["Parameter 2","minimum_water_temperature"]
["Unit of Measurement","degrees Celsius"]
["Instrument Type","Data Logger"]
["Instrument Manufacturer","Unknown"]
["Instrument Model","Unknown"]
["Serial Number","Unknown"]
["Range","Unknown"]
["Accuracy","Unknown"]
["Resolution","Unknown"]
["Calibration Notes","Unknown"]
["Time Zone","PT"]
["Notes on Methods","N/A"]
["Parameter 3","average_water_temperature"]
["Unit of Measurement","degrees Celsius"]
["Instrument Type","Data Logger"]
["Instrument Manufacturer","Unknown"]
["Instrument Model","Unknown"]
["Serial Number","Unknown"]
["Range","Unknown"]
["Accuracy","Unknown"]
["Resolution","Unknown"]
["Calibration Notes","Unknown"]
["Time Zone","PT"]
["Notes on Methods","N/A"]

{"sheet":"2.b Metadata Definitions","index":2,"n_rows":72,"n_cols":6,"rows_kept":72}
["Metadata Definitions"]
[" ","Definition","Format","Example"]
["Site ID","Unique name/code used to identify the monitoring site (assigned by monitoring organization). ","Text","SAH_01"]
["Waterbody Type","The type of waterbody the measurements were taken from","Text","Stream"]
["Waterbody","Name of the waterbody where monitoring took place.","Text ","Slocan Lake"]
["Location/Site Name","Geographically descriptive name of the monitoring site.","Text","Slocan River at Passmore Bridge"]
["Location Latitude","Latitude. Decimal degrees. ","Decimal degrees",51.048614]
["Location Longitude","Longitude. Decimal degrees.","Decimal degrees",-114.070821]
["Location Coordinate System","The datum that your latitude and longitude coordinates are based upon.","Pick From List","WGS84"]
["Elevation","The elevation of your monitoring location (metres above sea level)","Number",800]
["Measurement Interval","The timescale that measurements are being taken, ex. hourly, every 8 hours, weekly, monthly","Text","Hourly "]
["Site Photos in Dataset","Whether site photos will be included as a separate zipfile as part of the dataset this resource contains","Text","Yes"]
["Photo Resource Name","Name of the Resource that will contain photos relevant to this resource/site","Text","Monitoring Station Photos from Some Creek"]
["Parameter","Type of measurement being taken. Must be expressed without spaces or symbols, lower case, use underscores as needed.","Pick From List","Temperature"]
["Unit of Measurement","Unit of measurement for the parameter referred to above. Do not include symbols.","Pick From List","Degrees Celsius "]
["Instrument Type","The general category of instrument being used","Pick From List","Data Logger"]
["Instrument Manufacturer","Manufacturer of instrument used to measure this parameter","Text","YSI"]
["Instrument Model","Model of instrument used to measure this parameter","Text","6050020 Pro20"]
["Serial Number","Serial number of the instrument used to measure this parameter, if applicable","Text","20413527"]
["Accuracy","Accuracy of the instrument used to measure this parameter (can be found on manufacturer website), this must be entered in plain text without symbols","Text","Plus or minus 2 degrees C"]
["Range","Range of the instrument used to measure this parameter (can be found on manufacturer website)","Text","-5 to 70 degrees C (23 to 158 degrees F)"]
["Resolution","Resolution of the instrument used to measure this parameter (can be found on manufacturer website)","Text","0.1 degrees C"]
["Calibration Notes:","If applicable: How is this instrument calibrated? How frequently is this performed?","Text","Calibrated monthly using a standard solution, a calibration log is available on request"]
["Time Zone","The time zone used to record time of measurements, either local time at site, or the time zone that your instrument uses","Pick From List","PST"]
["Notes on Methods:","Details regarding methods used to measure this parameter","Text","Temperature measurements were taken 30cm from water's edge at a depth of 10cm"]
[]
["Measurement Intervals","Parameter Selection Choices","Unit Choices","Instrument Types","Time Zones","Coordinate Systems"]
["Fifteen Minutes","air_temperature","atm","Analog Thermometer","GMT","WGS84"]
["Thirty Minutes","alkalinity","centimetres","Bench Meter","GMT-6","NAD27"]
["Hourly","atmospheric_pressure","CFU per 100 mL","Climate Station","GMT-7","NAD83"]
["Four Hours","average_air_temperature","degrees Celsius","Data Logger","GMT-8","AMSMA"]
["Six Hours","average_water_temperature","degrees Fahrenheit","Hach Kit","MDT","ASTRO"]
["Eight Hours","battery_charge","kilometres per hour","pH meter","MST","GUAM"]
["Twelve Hours","calcium_total","hectopascal","Observation","MT","HARN"]
["Daily","chlorine","metres","Portable Photometer","PDT","JHNSN"]
["Weekly","clarity","metres above sea level","Portable Meter","PST","NAD27"]
["Biweekly","cloud_cover","metres below ground surface","Portable Multiparameter Meter","PT","NAD83"]
["Monthly","conductivity","metres per second","Rain Gauge","UTC","OLDHI"]
["Single Point Measurement","depth","metres3 per second","Secchi Disk","UTC-6","OTHER"]
["As Needed","discharge","milligrams per litre","Staff Gauge","UTC-7","PR"]
["Varied","dissolved_oxygen","millimetres","Unknown","UTC-8","SGEOR"]
[null,"e-coli","micromhos per centimetre","N/A","N/A","SLAWR"]
[null,"fecal_coliforms","microSiemens per centimetre",null,"Unknown","SPAUL"]
[null,"flow","mmHg",null,null,"UNKWN"]
[null,"hardness","most probable number per 100 mL",null,null,"WAKE"]
[null,"maximum_air_temperature","NTU",null,null,"WGS72"]
[null,"maxiumum_water_temperature","N/A",null,null,"WGS84"]
[null,"minimum_air_temperature","observation",null,null,"NAD83 / BC Albers"]
[null,"minimum_water_temperature","Pa",null,null,"NAD83/ UTM Zone 11"]
[null,"odour","parts per million",null,null,"NAD83/ UTM Zone 12"]
[null,"pH","percent",null,null,"Not specified"]
[null,"precipitation","pH units"]
[null,"snow_density","µg per litre"]
[null,"snow_depth","unknown"]
[null,"snow_water_equivalent","volts"]
[null,"specific_conductivity"]
[null,"surface_conditions"]
[null,"suspended_sediment"]
[null,"temperature_at_analyis"]
[null,"total_coliforms"]
[null,"total_dissolved_solids"]
[null,"total_suspended_solids"]
[null,"trophic_status"]
[null,"turbidity"]
[null,"velocity"]
[null,"water_clarity_secchi"]
[null,"water_colour"]
[null,"water_hardness"]
[null,"water_level"]
[null,"water_temperature"]
[null,"water_temperature_historic"]
[null,"weather_and_notes"]

{"sheet":" 3. Changelog","index":3,"n_rows":2,"n_cols":3,"rows_kept":2}
["Date of Modification","Description of Modification","Name of Person Modifying"]
["2022-04-06","Upload to new template, QA/QC","VS"]