{"text_format":"3","workbook":"xlsx","n_sheets":4,"sheets":["1. Observations","2. Metadata","2.b Metadata Definitions"," 3. Changelog"],"read":"whole","date_system":"1900"}

{"sheet":"1. Observations","index":0,"n_rows":263,"n_cols":12,"rows_kept":263}
["date_time","site_id","latitude","longitude","notes",{"$f":"IF(ISBLANK('2. Metadata'!B13)=TRUE,\" \",'2. Metadata'!B13)","v":"maxiumum_water_temperature"},{"$f":"IF(ISBLANK('2. Metadata'!B13)=TRUE,\" \",'2. Metadata'!B13&\"_units\")","v":"maxiumum_water_temperature_units"},{"$f":"IF(ISBLANK('2. Metadata'!B25)=TRUE,\" \",'2. Metadata'!B25)","v":"minimum_water_temperature"},{"$f":"IF(ISBLANK('2. Metadata'!B25)=TRUE,\" \",'2. Metadata'!B25&\"_units\")","v":"minimum_water_temperature_units"},{"$f":"IF(ISBLANK('2. Metadata'!B37)=TRUE,\" \",'2. Metadata'!B37)","v":"average_water_temperature"},{"$f":"IF(ISBLANK('2. Metadata'!B37)=TRUE,\" \",'2. Metadata'!B37&\"_units\")","v":"average_water_temperature_units"},"water_hub_qa_qc"]
["2013-08-04","NECAR01",{"$f":"IF(ISBLANK(B2)=TRUE,\" \", IF(B2='2. Metadata'!B$1,'2. Metadata'!B$5, IF(B2='2. Metadata'!C$1,'2. Metadata'!C$5,IF(B2='2. Metadata'!D$1,'2. Metadata'!D$5, IF(B2='2. Metadata'!E$1,'2. Metadata'!E$5,IF( B2='2. Metadata'!F$1,'2. Metadata'!F$5,IF(B2='2. Metadata'!G$1,'2. Metadata'!G$5,IF(B2='2. Metadata'!H$1,'2. Metadata'!H$5, IF(B2='2. Metadata'!I$1,'2. Metadata'!I$5, IF(B2='2. Metadata'!J$1,'2. Metadata'!J$5, IF(B2='2. Metadata'!K$1,'2. Metadata'!K$5, IF(B2='2. Metadata'!L$1,'2. Metadata'!L$5, IF(B2='2. Metadata'!M$1,'2. Metadata'!M$5, IF(B2='2. Metadata'!N$1,'2. Metadata'!N$5))))))))))))))","v":49.97944},{"$f":"IF(ISBLANK(B2)=TRUE,\" \", IF(B2='2. Metadata'!B$1,'2. Metadata'!B$6, IF(B2='2. Metadata'!C$1,'2. Metadata'!C$6,IF(B2='2. Metadata'!D$1,'2. Metadata'!D$6, IF(B2='2. Metadata'!E$1,'2. Metadata'!E$6,IF( B2='2. Metadata'!F$1,'2. Metadata'!F$6,IF(B2='2. Metadata'!G$1,'2. Metadata'!G$6,IF(B2='2. Metadata'!H$1,'2. Metadata'!H$6, IF(B2='2. Metadata'!I$1,'2. Metadata'!I$6, IF(B2='2. Metadata'!J$1,'2. Metadata'!J$6, IF(B2='2. Metadata'!K$1,'2. Metadata'!K$6, IF(B2='2. Metadata'!L$1,'2. Metadata'!L$6, IF(B2='2. Metadata'!M$1,'2. Metadata'!M$6, IF(B2='2. Metadata'!N$1,'2. Metadata'!N$6))))))))))))))","v":-117.88417},"n/a",15.055,{"$f":"IF(ISBLANK(F2)=TRUE,\" \",'2. Metadata'!B$14)","v":"degrees Celsius"},12.799,{"$f":"IF(ISBLANK(H2)=TRUE,\" \",'2. Metadata'!B$26)","v":"degrees Celsius"},13.785,{"$f":"IF(ISBLANK(J2)=TRUE,\" \",'2. Metadata'!B$38)","v":"degrees Celsius"},"n/a"]
["2013-08-05","NECAR01",{"$f":"IF(ISBLANK(B3)=TRUE,\" \", IF(B3='2. Metadata'!B$1,'2. Metadata'!B$5, IF(B3='2. Metadata'!C$1,'2. Metadata'!C$5,IF(B3='2. Metadata'!D$1,'2. Metadata'!D$5, IF(B3='2. Metadata'!E$1,'2. Metadata'!E$5,IF( B3='2. Metadata'!F$1,'2. Metadata'!F$5,IF(B3='2. Metadata'!G$1,'2. Metadata'!G$5,IF(B3='2. Metadata'!H$1,'2. Metadata'!H$5, IF(B3='2. Metadata'!I$1,'2. Metadata'!I$5, IF(B3='2. Metadata'!J$1,'2. Metadata'!J$5, IF(B3='2. Metadata'!K$1,'2. Metadata'!K$5, IF(B3='2. Metadata'!L$1,'2. Metadata'!L$5, IF(B3='2. Metadata'!M$1,'2. Metadata'!M$5, IF(B3='2. Metadata'!N$1,'2. Metadata'!N$5))))))))))))))","v":49.97944},{"$f":"IF(ISBLANK(B3)=TRUE,\" \", IF(B3='2. Metadata'!B$1,'2. Metadata'!B$6, IF(B3='2. Metadata'!C$1,'2. Metadata'!C$6,IF(B3='2. Metadata'!D$1,'2. Metadata'!D$6, IF(B3='2. Metadata'!E$1,'2. Metadata'!E$6,IF( B3='2. Metadata'!F$1,'2. Metadata'!F$6,IF(B3='2. Metadata'!G$1,'2. Metadata'!G$6,IF(B3='2. Metadata'!H$1,'2. Metadata'!H$6, IF(B3='2. Metadata'!I$1,'2. Metadata'!I$6, IF(B3='2. Metadata'!J$1,'2. Metadata'!J$6, IF(B3='2. Metadata'!K$1,'2. Metadata'!K$6, IF(B3='2. Metadata'!L$1,'2. Metadata'!L$6, IF(B3='2. Metadata'!M$1,'2. Metadata'!M$6, IF(B3='2. Metadata'!N$1,'2. Metadata'!N$6))))))))))))))","v":-117.88417},"n/a",15.342,{"$f":"IF(ISBLANK(F3)=TRUE,\" \",'2. Metadata'!B$14)","v":"degrees Celsius"},12.098,{"$f":"IF(ISBLANK(H3)=TRUE,\" \",'2. Metadata'!B$26)","v":"degrees Celsius"},13.531,{"$f":"IF(ISBLANK(J3)=TRUE,\" \",'2. Metadata'!B$38)","v":"degrees Celsius"},"n/a"]
["2013-08-06","NECAR01",{"$f":"IF(ISBLANK(B4)=TRUE,\" \", IF(B4='2. Metadata'!B$1,'2. Metadata'!B$5, IF(B4='2. Metadata'!C$1,'2. Metadata'!C$5,IF(B4='2. Metadata'!D$1,'2. Metadata'!D$5, IF(B4='2. Metadata'!E$1,'2. Metadata'!E$5,IF( B4='2. Metadata'!F$1,'2. Metadata'!F$5,IF(B4='2. Metadata'!G$1,'2. Metadata'!G$5,IF(B4='2. Metadata'!H$1,'2. Metadata'!H$5, IF(B4='2. Metadata'!I$1,'2. Metadata'!I$5, IF(B4='2. Metadata'!J$1,'2. Metadata'!J$5, IF(B4='2. Metadata'!K$1,'2. Metadata'!K$5, IF(B4='2. Metadata'!L$1,'2. Metadata'!L$5, IF(B4='2. Metadata'!M$1,'2. Metadata'!M$5, IF(B4='2. Metadata'!N$1,'2. Metadata'!N$5))))))))))))))","v":49.97944},{"$f":"IF(ISBLANK(B4)=TRUE,\" \", IF(B4='2. Metadata'!B$1,'2. Metadata'!B$6, IF(B4='2. Metadata'!C$1,'2. Metadata'!C$6,IF(B4='2. Metadata'!D$1,'2. Metadata'!D$6, IF(B4='2. Metadata'!E$1,'2. Metadata'!E$6,IF( B4='2. Metadata'!F$1,'2. Metadata'!F$6,IF(B4='2. Metadata'!G$1,'2. Metadata'!G$6,IF(B4='2. Metadata'!H$1,'2. Metadata'!H$6, IF(B4='2. Metadata'!I$1,'2. Metadata'!I$6, IF(B4='2. Metadata'!J$1,'2. Metadata'!J$6, IF(B4='2. Metadata'!K$1,'2. Metadata'!K$6, IF(B4='2. Metadata'!L$1,'2. Metadata'!L$6, IF(B4='2. Metadata'!M$1,'2. Metadata'!M$6, IF(B4='2. Metadata'!N$1,'2. Metadata'!N$6))))))))))))))","v":-117.88417},"n/a",15.772,{"$f":"IF(ISBLANK(F4)=TRUE,\" \",'2. Metadata'!B$14)","v":"degrees Celsius"},12.074,{"$f":"IF(ISBLANK(H4)=TRUE,\" \",'2. Metadata'!B$26)","v":"degrees Celsius"},13.845,{"$f":"IF(ISBLANK(J4)=TRUE,\" \",'2. Metadata'!B$38)","v":"degrees Celsius"},"n/a"]
["2013-08-07","NECAR01",{"$f":"IF(ISBLANK(B5)=TRUE,\" \", IF(B5='2. Metadata'!B$1,'2. Metadata'!B$5, IF(B5='2. Metadata'!C$1,'2. Metadata'!C$5,IF(B5='2. Metadata'!D$1,'2. Metadata'!D$5, IF(B5='2. Metadata'!E$1,'2. Metadata'!E$5,IF( B5='2. Metadata'!F$1,'2. Metadata'!F$5,IF(B5='2. Metadata'!G$1,'2. Metadata'!G$5,IF(B5='2. Metadata'!H$1,'2. Metadata'!H$5, IF(B5='2. Metadata'!I$1,'2. Metadata'!I$5, IF(B5='2. Metadata'!J$1,'2. Metadata'!J$5, IF(B5='2. Metadata'!K$1,'2. Metadata'!K$5, IF(B5='2. Metadata'!L$1,'2. Metadata'!L$5, IF(B5='2. Metadata'!M$1,'2. Metadata'!M$5, IF(B5='2. Metadata'!N$1,'2. Metadata'!N$5))))))))))))))","v":49.97944},{"$f":"IF(ISBLANK(B5)=TRUE,\" \", IF(B5='2. Metadata'!B$1,'2. Metadata'!B$6, IF(B5='2. Metadata'!C$1,'2. Metadata'!C$6,IF(B5='2. Metadata'!D$1,'2. Metadata'!D$6, IF(B5='2. Metadata'!E$1,'2. Metadata'!E$6,IF( B5='2. Metadata'!F$1,'2. Metadata'!F$6,IF(B5='2. Metadata'!G$1,'2. Metadata'!G$6,IF(B5='2. Metadata'!H$1,'2. Metadata'!H$6, IF(B5='2. Metadata'!I$1,'2. Metadata'!I$6, IF(B5='2. Metadata'!J$1,'2. Metadata'!J$6, IF(B5='2. Metadata'!K$1,'2. Metadata'!K$6, IF(B5='2. Metadata'!L$1,'2. Metadata'!L$6, IF(B5='2. Metadata'!M$1,'2. Metadata'!M$6, IF(B5='2. Metadata'!N$1,'2. Metadata'!N$6))))))))))))))","v":-117.88417},"n/a",16.63,{"$f":"IF(ISBLANK(F5)=TRUE,\" \",'2. Metadata'!B$14)","v":"degrees Celsius"},12.654,{"$f":"IF(ISBLANK(H5)=TRUE,\" \",'2. Metadata'!B$26)","v":"degrees Celsius"},14.3,{"$f":"IF(ISBLANK(J5)=TRUE,\" \",'2. Metadata'!B$38)","v":"degrees Celsius"},"n/a"]
["2013-08-08","NECAR01",{"$f":"IF(ISBLANK(B6)=TRUE,\" \", IF(B6='2. Metadata'!B$1,'2. Metadata'!B$5, IF(B6='2. Metadata'!C$1,'2. Metadata'!C$5,IF(B6='2. Metadata'!D$1,'2. Metadata'!D$5, IF(B6='2. Metadata'!E$1,'2. Metadata'!E$5,IF( B6='2. Metadata'!F$1,'2. Metadata'!F$5,IF(B6='2. Metadata'!G$1,'2. Metadata'!G$5,IF(B6='2. Metadata'!H$1,'2. Metadata'!H$5, IF(B6='2. Metadata'!I$1,'2. Metadata'!I$5, IF(B6='2. Metadata'!J$1,'2. Metadata'!J$5, IF(B6='2. Metadata'!K$1,'2. Metadata'!K$5, IF(B6='2. Metadata'!L$1,'2. Metadata'!L$5, IF(B6='2. Metadata'!M$1,'2. Metadata'!M$5, IF(B6='2. Metadata'!N$1,'2. Metadata'!N$5))))))))))))))","v":49.97944},{"$f":"IF(ISBLANK(B6)=TRUE,\" \", IF(B6='2. Metadata'!B$1,'2. Metadata'!B$6, IF(B6='2. Metadata'!C$1,'2. Metadata'!C$6,IF(B6='2. Metadata'!D$1,'2. Metadata'!D$6, IF(B6='2. Metadata'!E$1,'2. Metadata'!E$6,IF( B6='2. Metadata'!F$1,'2. Metadata'!F$6,IF(B6='2. Metadata'!G$1,'2. Metadata'!G$6,IF(B6='2. Metadata'!H$1,'2. Metadata'!H$6, IF(B6='2. Metadata'!I$1,'2. Metadata'!I$6, IF(B6='2. Metadata'!J$1,'2. Metadata'!J$6, IF(B6='2. Metadata'!K$1,'2. Metadata'!K$6, IF(B6='2. Metadata'!L$1,'2. Metadata'!L$6, IF(B6='2. Metadata'!M$1,'2. Metadata'!M$6, IF(B6='2. Metadata'!N$1,'2. Metadata'!N$6))))))))))))))","v":-117.88417},"n/a",16.153,{"$f":"IF(ISBLANK(F6)=TRUE,\" \",'2. Metadata'!B$14)","v":"degrees Celsius"},12.703,{"$f":"IF(ISBLANK(H6)=TRUE,\" \",'2. Metadata'!B$26)","v":"degrees Celsius"},14.243,{"$f":"IF(ISBLANK(J6)=TRUE,\" \",'2. Metadata'!B$38)","v":"degrees Celsius"},"n/a"]
["2013-08-09","NECAR01",{"$f":"IF(ISBLANK(B7)=TRUE,\" \", IF(B7='2. Metadata'!B$1,'2. Metadata'!B$5, IF(B7='2. Metadata'!C$1,'2. Metadata'!C$5,IF(B7='2. Metadata'!D$1,'2. Metadata'!D$5, IF(B7='2. Metadata'!E$1,'2. Metadata'!E$5,IF( B7='2. Metadata'!F$1,'2. Metadata'!F$5,IF(B7='2. Metadata'!G$1,'2. Metadata'!G$5,IF(B7='2. Metadata'!H$1,'2. Metadata'!H$5, IF(B7='2. Metadata'!I$1,'2. Metadata'!I$5, IF(B7='2. Metadata'!J$1,'2. Metadata'!J$5, IF(B7='2. Metadata'!K$1,'2. Metadata'!K$5, IF(B7='2. Metadata'!L$1,'2. Metadata'!L$5, IF(B7='2. Metadata'!M$1,'2. Metadata'!M$5, IF(B7='2. Metadata'!N$1,'2. Metadata'!N$5))))))))))))))","v":49.97944},{"$f":"IF(ISBLANK(B7)=TRUE,\" \", IF(B7='2. Metadata'!B$1,'2. Metadata'!B$6, IF(B7='2. Metadata'!C$1,'2. Metadata'!C$6,IF(B7='2. Metadata'!D$1,'2. Metadata'!D$6, IF(B7='2. Metadata'!E$1,'2. Metadata'!E$6,IF( B7='2. Metadata'!F$1,'2. Metadata'!F$6,IF(B7='2. Metadata'!G$1,'2. Metadata'!G$6,IF(B7='2. Metadata'!H$1,'2. Metadata'!H$6, IF(B7='2. Metadata'!I$1,'2. Metadata'!I$6, IF(B7='2. Metadata'!J$1,'2. Metadata'!J$6, IF(B7='2. Metadata'!K$1,'2. Metadata'!K$6, IF(B7='2. Metadata'!L$1,'2. Metadata'!L$6, IF(B7='2. Metadata'!M$1,'2. Metadata'!M$6, IF(B7='2. Metadata'!N$1,'2. Metadata'!N$6))))))))))))))","v":-117.88417},"n/a",16.463,{"$f":"IF(ISBLANK(F7)=TRUE,\" \",'2. Metadata'!B$14)","v":"degrees Celsius"},12.799,{"$f":"IF(ISBLANK(H7)=TRUE,\" \",'2. Metadata'!B$26)","v":"degrees Celsius"},14.323,{"$f":"IF(ISBLANK(J7)=TRUE,\" \",'2. Metadata'!B$38)","v":"degrees Celsius"},"n/a"]
["2013-08-10","NECAR01",{"$f":"IF(ISBLANK(B8)=TRUE,\" \", IF(B8='2. Metadata'!B$1,'2. Metadata'!B$5, IF(B8='2. Metadata'!C$1,'2. Metadata'!C$5,IF(B8='2. Metadata'!D$1,'2. Metadata'!D$5, IF(B8='2. Metadata'!E$1,'2. Metadata'!E$5,IF( B8='2. Metadata'!F$1,'2. Metadata'!F$5,IF(B8='2. Metadata'!G$1,'2. Metadata'!G$5,IF(B8='2. Metadata'!H$1,'2. Metadata'!H$5, IF(B8='2. Metadata'!I$1,'2. Metadata'!I$5, IF(B8='2. Metadata'!J$1,'2. Metadata'!J$5, IF(B8='2. Metadata'!K$1,'2. Metadata'!K$5, IF(B8='2. Metadata'!L$1,'2. Metadata'!L$5, IF(B8='2. Metadata'!M$1,'2. Metadata'!M$5, IF(B8='2. Metadata'!N$1,'2. Metadata'!N$5))))))))))))))","v":49.97944},{"$f":"IF(ISBLANK(B8)=TRUE,\" \", IF(B8='2. Metadata'!B$1,'2. Metadata'!B$6, IF(B8='2. Metadata'!C$1,'2. Metadata'!C$6,IF(B8='2. Metadata'!D$1,'2. Metadata'!D$6, IF(B8='2. Metadata'!E$1,'2. Metadata'!E$6,IF( B8='2. Metadata'!F$1,'2. Metadata'!F$6,IF(B8='2. Metadata'!G$1,'2. Metadata'!G$6,IF(B8='2. Metadata'!H$1,'2. Metadata'!H$6, IF(B8='2. Metadata'!I$1,'2. Metadata'!I$6, IF(B8='2. Metadata'!J$1,'2. Metadata'!J$6, IF(B8='2. Metadata'!K$1,'2. Metadata'!K$6, IF(B8='2. Metadata'!L$1,'2. Metadata'!L$6, IF(B8='2. Metadata'!M$1,'2. Metadata'!M$6, IF(B8='2. Metadata'!N$1,'2. Metadata'!N$6))))))))))))))","v":-117.88417},"n/a",16.511,{"$f":"IF(ISBLANK(F8)=TRUE,\" \",'2. Metadata'!B$14)","v":"degrees Celsius"},13.088,{"$f":"IF(ISBLANK(H8)=TRUE,\" \",'2. Metadata'!B$26)","v":"degrees Celsius"},14.57,{"$f":"IF(ISBLANK(J8)=TRUE,\" \",'2. Metadata'!B$38)","v":"degrees Celsius"},"n/a"]
["2013-08-11","NECAR01",{"$f":"IF(ISBLANK(B9)=TRUE,\" \", IF(B9='2. Metadata'!B$1,'2. Metadata'!B$5, IF(B9='2. Metadata'!C$1,'2. Metadata'!C$5,IF(B9='2. Metadata'!D$1,'2. Metadata'!D$5, IF(B9='2. Metadata'!E$1,'2. Metadata'!E$5,IF( B9='2. Metadata'!F$1,'2. Metadata'!F$5,IF(B9='2. Metadata'!G$1,'2. Metadata'!G$5,IF(B9='2. Metadata'!H$1,'2. Metadata'!H$5, IF(B9='2. Metadata'!I$1,'2. Metadata'!I$5, IF(B9='2. Metadata'!J$1,'2. Metadata'!J$5, IF(B9='2. Metadata'!K$1,'2. Metadata'!K$5, IF(B9='2. Metadata'!L$1,'2. Metadata'!L$5, IF(B9='2. Metadata'!M$1,'2. Metadata'!M$5, IF(B9='2. Metadata'!N$1,'2. Metadata'!N$5))))))))))))))","v":49.97944},{"$f":"IF(ISBLANK(B9)=TRUE,\" \", IF(B9='2. Metadata'!B$1,'2. Metadata'!B$6, IF(B9='2. Metadata'!C$1,'2. Metadata'!C$6,IF(B9='2. Metadata'!D$1,'2. Metadata'!D$6, IF(B9='2. Metadata'!E$1,'2. Metadata'!E$6,IF( B9='2. Metadata'!F$1,'2. Metadata'!F$6,IF(B9='2. Metadata'!G$1,'2. Metadata'!G$6,IF(B9='2. Metadata'!H$1,'2. Metadata'!H$6, IF(B9='2. Metadata'!I$1,'2. Metadata'!I$6, IF(B9='2. Metadata'!J$1,'2. Metadata'!J$6, IF(B9='2. Metadata'!K$1,'2. Metadata'!K$6, IF(B9='2. Metadata'!L$1,'2. Metadata'!L$6, IF(B9='2. Metadata'!M$1,'2. Metadata'!M$6, IF(B9='2. Metadata'!N$1,'2. Metadata'!N$6))))))))))))))","v":-117.88417},"n/a",16.392,{"$f":"IF(ISBLANK(F9)=TRUE,\" \",'2. Metadata'!B$14)","v":"degrees Celsius"},12.944,{"$f":"IF(ISBLANK(H9)=TRUE,\" \",'2. Metadata'!B$26)","v":"degrees Celsius"},14.307,{"$f":"IF(ISBLANK(J9)=TRUE,\" \",'2. Metadata'!B$38)","v":"degrees Celsius"},"n/a"]
["2013-08-12","NECAR01",{"$f":"IF(ISBLANK(B10)=TRUE,\" \", IF(B10='2. Metadata'!B$1,'2. Metadata'!B$5, IF(B10='2. Metadata'!C$1,'2. Metadata'!C$5,IF(B10='2. Metadata'!D$1,'2. Metadata'!D$5, IF(B10='2. Metadata'!E$1,'2. Metadata'!E$5,IF( B10='2. Metadata'!F$1,'2. Metadata'!F$5,IF(B10='2. Metadata'!G$1,'2. Metadata'!G$5,IF(B10='2. Metadata'!H$1,'2. Metadata'!H$5, IF(B10='2. Metadata'!I$1,'2. Metadata'!I$5, IF(B10='2. Metadata'!J$1,'2. Metadata'!J$5, IF(B10='2. Metadata'!K$1,'2. Metadata'!K$5, IF(B10='2. Metadata'!L$1,'2. Metadata'!L$5, IF(B10='2. Metadata'!M$1,'2. Metadata'!M$5, IF(B10='2. Metadata'!N$1,'2. Metadata'!N$5))))))))))))))","v":49.97944},{"$f":"IF(ISBLANK(B10)=TRUE,\" \", IF(B10='2. Metadata'!B$1,'2. Metadata'!B$6, IF(B10='2. Metadata'!C$1,'2. Metadata'!C$6,IF(B10='2. Metadata'!D$1,'2. Metadata'!D$6, IF(B10='2. Metadata'!E$1,'2. Metadata'!E$6,IF( B10='2. Metadata'!F$1,'2. Metadata'!F$6,IF(B10='2. Metadata'!G$1,'2. Metadata'!G$6,IF(B10='2. Metadata'!H$1,'2. Metadata'!H$6, IF(B10='2. Metadata'!I$1,'2. Metadata'!I$6, IF(B10='2. Metadata'!J$1,'2. Metadata'!J$6, IF(B10='2. Metadata'!K$1,'2. Metadata'!K$6, IF(B10='2. Metadata'!L$1,'2. Metadata'!L$6, IF(B10='2. Metadata'!M$1,'2. Metadata'!M$6, IF(B10='2. Metadata'!N$1,'2. Metadata'!N$6))))))))))))))","v":-117.88417},"n/a",15.581,{"$f":"IF(ISBLANK(F10)=TRUE,\" \",'2. Metadata'!B$14)","v":"degrees Celsius"},13.329,{"$f":"IF(ISBLANK(H10)=TRUE,\" \",'2. Metadata'!B$26)","v":"degrees Celsius"},14.334,{"$f":"IF(ISBLANK(J10)=TRUE,\" \",'2. Metadata'!B$38)","v":"degrees Celsius"},"n/a"]
["2013-08-13","NECAR01",{"$f":"IF(ISBLANK(B11)=TRUE,\" \", IF(B11='2. Metadata'!B$1,'2. Metadata'!B$5, IF(B11='2. Metadata'!C$1,'2. Metadata'!C$5,IF(B11='2. Metadata'!D$1,'2. Metadata'!D$5, IF(B11='2. Metadata'!E$1,'2. Metadata'!E$5,IF( B11='2. Metadata'!F$1,'2. Metadata'!F$5,IF(B11='2. Metadata'!G$1,'2. Metadata'!G$5,IF(B11='2. Metadata'!H$1,'2. Metadata'!H$5, IF(B11='2. Metadata'!I$1,'2. Metadata'!I$5, IF(B11='2. Metadata'!J$1,'2. Metadata'!J$5, IF(B11='2. Metadata'!K$1,'2. Metadata'!K$5, IF(B11='2. Metadata'!L$1,'2. Metadata'!L$5, IF(B11='2. Metadata'!M$1,'2. Metadata'!M$5, IF(B11='2. Metadata'!N$1,'2. Metadata'!N$5))))))))))))))","v":49.97944},{"$f":"IF(ISBLANK(B11)=TRUE,\" \", IF(B11='2. Metadata'!B$1,'2. Metadata'!B$6, IF(B11='2. Metadata'!C$1,'2. Metadata'!C$6,IF(B11='2. Metadata'!D$1,'2. Metadata'!D$6, IF(B11='2. Metadata'!E$1,'2. Metadata'!E$6,IF( B11='2. Metadata'!F$1,'2. Metadata'!F$6,IF(B11='2. Metadata'!G$1,'2. Metadata'!G$6,IF(B11='2. Metadata'!H$1,'2. Metadata'!H$6, IF(B11='2. Metadata'!I$1,'2. Metadata'!I$6, IF(B11='2. Metadata'!J$1,'2. Metadata'!J$6, IF(B11='2. Metadata'!K$1,'2. Metadata'!K$6, IF(B11='2. Metadata'!L$1,'2. Metadata'!L$6, IF(B11='2. Metadata'!M$1,'2. Metadata'!M$6, IF(B11='2. Metadata'!N$1,'2. Metadata'!N$6))))))))))))))","v":-117.88417},"n/a",16.534,{"$f":"IF(ISBLANK(F11)=TRUE,\" \",'2. Metadata'!B$14)","v":"degrees Celsius"},12.63,{"$f":"IF(ISBLANK(H11)=TRUE,\" \",'2. Metadata'!B$26)","v":"degrees Celsius"},14.291,{"$f":"IF(ISBLANK(J11)=TRUE,\" \",'2. Metadata'!B$38)","v":"degrees Celsius"},"n/a"]
["2013-08-14","NECAR01",{"$f":"IF(ISBLANK(B12)=TRUE,\" \", IF(B12='2. Metadata'!B$1,'2. Metadata'!B$5, IF(B12='2. Metadata'!C$1,'2. Metadata'!C$5,IF(B12='2. Metadata'!D$1,'2. Metadata'!D$5, IF(B12='2. Metadata'!E$1,'2. Metadata'!E$5,IF( B12='2. Metadata'!F$1,'2. Metadata'!F$5,IF(B12='2. Metadata'!G$1,'2. Metadata'!G$5,IF(B12='2. Metadata'!H$1,'2. Metadata'!H$5, IF(B12='2. Metadata'!I$1,'2. Metadata'!I$5, IF(B12='2. Metadata'!J$1,'2. Metadata'!J$5, IF(B12='2. Metadata'!K$1,'2. Metadata'!K$5, IF(B12='2. Metadata'!L$1,'2. Metadata'!L$5, IF(B12='2. Metadata'!M$1,'2. Metadata'!M$5, IF(B12='2. Metadata'!N$1,'2. Metadata'!N$5))))))))))))))","v":49.97944},{"$f":"IF(ISBLANK(B12)=TRUE,\" \", IF(B12='2. Metadata'!B$1,'2. Metadata'!B$6, IF(B12='2. Metadata'!C$1,'2. Metadata'!C$6,IF(B12='2. Metadata'!D$1,'2. Metadata'!D$6, IF(B12='2. Metadata'!E$1,'2. Metadata'!E$6,IF( B12='2. Metadata'!F$1,'2. Metadata'!F$6,IF(B12='2. Metadata'!G$1,'2. Metadata'!G$6,IF(B12='2. Metadata'!H$1,'2. Metadata'!H$6, IF(B12='2. Metadata'!I$1,'2. Metadata'!I$6, IF(B12='2. Metadata'!J$1,'2. Metadata'!J$6, IF(B12='2. Metadata'!K$1,'2. Metadata'!K$6, IF(B12='2. Metadata'!L$1,'2. Metadata'!L$6, IF(B12='2. Metadata'!M$1,'2. Metadata'!M$6, IF(B12='2. Metadata'!N$1,'2. Metadata'!N$6))))))))))))))","v":-117.88417},"n/a",16.296,{"$f":"IF(ISBLANK(F12)=TRUE,\" \",'2. Metadata'!B$14)","v":"degrees Celsius"},12.896,{"$f":"IF(ISBLANK(H12)=TRUE,\" \",'2. Metadata'!B$26)","v":"degrees Celsius"},14.469,{"$f":"IF(ISBLANK(J12)=TRUE,\" \",'2. Metadata'!B$38)","v":"degrees Celsius"},"n/a"]
["2013-08-15","NECAR01",{"$f":"IF(ISBLANK(B13)=TRUE,\" \", IF(B13='2. Metadata'!B$1,'2. Metadata'!B$5, IF(B13='2. Metadata'!C$1,'2. Metadata'!C$5,IF(B13='2. Metadata'!D$1,'2. Metadata'!D$5, IF(B13='2. Metadata'!E$1,'2. Metadata'!E$5,IF( B13='2. Metadata'!F$1,'2. Metadata'!F$5,IF(B13='2. Metadata'!G$1,'2. Metadata'!G$5,IF(B13='2. Metadata'!H$1,'2. Metadata'!H$5, IF(B13='2. Metadata'!I$1,'2. Metadata'!I$5, IF(B13='2. Metadata'!J$1,'2. Metadata'!J$5, IF(B13='2. Metadata'!K$1,'2. Metadata'!K$5, IF(B13='2. Metadata'!L$1,'2. Metadata'!L$5, IF(B13='2. Metadata'!M$1,'2. Metadata'!M$5, IF(B13='2. Metadata'!N$1,'2. Metadata'!N$5))))))))))))))","v":49.97944},{"$f":"IF(ISBLANK(B13)=TRUE,\" \", IF(B13='2. Metadata'!B$1,'2. Metadata'!B$6, IF(B13='2. Metadata'!C$1,'2. Metadata'!C$6,IF(B13='2. Metadata'!D$1,'2. Metadata'!D$6, IF(B13='2. Metadata'!E$1,'2. Metadata'!E$6,IF( B13='2. Metadata'!F$1,'2. Metadata'!F$6,IF(B13='2. Metadata'!G$1,'2. Metadata'!G$6,IF(B13='2. Metadata'!H$1,'2. Metadata'!H$6, IF(B13='2. Metadata'!I$1,'2. Metadata'!I$6, IF(B13='2. Metadata'!J$1,'2. Metadata'!J$6, IF(B13='2. Metadata'!K$1,'2. Metadata'!K$6, IF(B13='2. Metadata'!L$1,'2. Metadata'!L$6, IF(B13='2. Metadata'!M$1,'2. Metadata'!M$6, IF(B13='2. Metadata'!N$1,'2. Metadata'!N$6))))))))))))))","v":-117.88417},"n/a",16.344,{"$f":"IF(ISBLANK(F13)=TRUE,\" \",'2. Metadata'!B$14)","v":"degrees Celsius"},13.497,{"$f":"IF(ISBLANK(H13)=TRUE,\" \",'2. Metadata'!B$26)","v":"degrees Celsius"},14.847,{"$f":"IF(ISBLANK(J13)=TRUE,\" \",'2. Metadata'!B$38)","v":"degrees Celsius"},"n/a"]
["2013-08-16","NECAR01",{"$f":"IF(ISBLANK(B14)=TRUE,\" \", IF(B14='2. Metadata'!B$1,'2. Metadata'!B$5, IF(B14='2. Metadata'!C$1,'2. Metadata'!C$5,IF(B14='2. Metadata'!D$1,'2. Metadata'!D$5, IF(B14='2. Metadata'!E$1,'2. Metadata'!E$5,IF( B14='2. Metadata'!F$1,'2. Metadata'!F$5,IF(B14='2. Metadata'!G$1,'2. Metadata'!G$5,IF(B14='2. Metadata'!H$1,'2. Metadata'!H$5, IF(B14='2. Metadata'!I$1,'2. Metadata'!I$5, IF(B14='2. Metadata'!J$1,'2. Metadata'!J$5, IF(B14='2. Metadata'!K$1,'2. Metadata'!K$5, IF(B14='2. Metadata'!L$1,'2. Metadata'!L$5, IF(B14='2. Metadata'!M$1,'2. Metadata'!M$5, IF(B14='2. Metadata'!N$1,'2. Metadata'!N$5))))))))))))))","v":49.97944},{"$f":"IF(ISBLANK(B14)=TRUE,\" \", IF(B14='2. Metadata'!B$1,'2. Metadata'!B$6, IF(B14='2. Metadata'!C$1,'2. Metadata'!C$6,IF(B14='2. Metadata'!D$1,'2. Metadata'!D$6, IF(B14='2. Metadata'!E$1,'2. Metadata'!E$6,IF( B14='2. Metadata'!F$1,'2. Metadata'!F$6,IF(B14='2. Metadata'!G$1,'2. Metadata'!G$6,IF(B14='2. Metadata'!H$1,'2. Metadata'!H$6, IF(B14='2. Metadata'!I$1,'2. Metadata'!I$6, IF(B14='2. Metadata'!J$1,'2. Metadata'!J$6, IF(B14='2. Metadata'!K$1,'2. Metadata'!K$6, IF(B14='2. Metadata'!L$1,'2. Metadata'!L$6, IF(B14='2. Metadata'!M$1,'2. Metadata'!M$6, IF(B14='2. Metadata'!N$1,'2. Metadata'!N$6))))))))))))))","v":-117.88417},"n/a",16.582,{"$f":"IF(ISBLANK(F14)=TRUE,\" \",'2. Metadata'!B$14)","v":"degrees Celsius"},13.594,{"$f":"IF(ISBLANK(H14)=TRUE,\" \",'2. Metadata'!B$26)","v":"degrees Celsius"},14.835,{"$f":"IF(ISBLANK(J14)=TRUE,\" \",'2. Metadata'!B$38)","v":"degrees Celsius"},"n/a"]
["2013-08-17","NECAR01",{"$f":"IF(ISBLANK(B15)=TRUE,\" \", IF(B15='2. Metadata'!B$1,'2. Metadata'!B$5, IF(B15='2. Metadata'!C$1,'2. Metadata'!C$5,IF(B15='2. Metadata'!D$1,'2. Metadata'!D$5, IF(B15='2. Metadata'!E$1,'2. Metadata'!E$5,IF( B15='2. Metadata'!F$1,'2. Metadata'!F$5,IF(B15='2. Metadata'!G$1,'2. Metadata'!G$5,IF(B15='2. Metadata'!H$1,'2. Metadata'!H$5, IF(B15='2. Metadata'!I$1,'2. Metadata'!I$5, IF(B15='2. Metadata'!J$1,'2. Metadata'!J$5, IF(B15='2. Metadata'!K$1,'2. Metadata'!K$5, IF(B15='2. Metadata'!L$1,'2. Metadata'!L$5, IF(B15='2. Metadata'!M$1,'2. Metadata'!M$5, IF(B15='2. Metadata'!N$1,'2. Metadata'!N$5))))))))))))))","v":49.97944},{"$f":"IF(ISBLANK(B15)=TRUE,\" \", IF(B15='2. Metadata'!B$1,'2. Metadata'!B$6, IF(B15='2. Metadata'!C$1,'2. Metadata'!C$6,IF(B15='2. Metadata'!D$1,'2. Metadata'!D$6, IF(B15='2. Metadata'!E$1,'2. Metadata'!E$6,IF( B15='2. Metadata'!F$1,'2. Metadata'!F$6,IF(B15='2. Metadata'!G$1,'2. Metadata'!G$6,IF(B15='2. Metadata'!H$1,'2. Metadata'!H$6, IF(B15='2. Metadata'!I$1,'2. Metadata'!I$6, IF(B15='2. Metadata'!J$1,'2. Metadata'!J$6, IF(B15='2. Metadata'!K$1,'2. Metadata'!K$6, IF(B15='2. Metadata'!L$1,'2. Metadata'!L$6, IF(B15='2. Metadata'!M$1,'2. Metadata'!M$6, IF(B15='2. Metadata'!N$1,'2. Metadata'!N$6))))))))))))))","v":-117.88417},"n/a",15.485,{"$f":"IF(ISBLANK(F15)=TRUE,\" \",'2. Metadata'!B$14)","v":"degrees Celsius"},13.281,{"$f":"IF(ISBLANK(H15)=TRUE,\" \",'2. Metadata'!B$26)","v":"degrees Celsius"},14.325,{"$f":"IF(ISBLANK(J15)=TRUE,\" \",'2. Metadata'!B$38)","v":"degrees Celsius"},"n/a"]
{"$rows_left_out":249}
{"sheet":"2. Metadata","index":1,"n_rows":48,"n_cols":2,"rows_kept":48}
["Site ID","NECAR01"]
["Location/Site Name","Caribou Ck. Site 1"]
["Waterbody Type","Streams"]
["Waterbody","Caribou Creek"]
["Site Latitude (decimal degrees)",49.97944]
["Site Longitude (decimal degrees)",-117.88417]
["Coordinate System","WGS84"]
["Site Elevation (masl)",1450]
["Measurement Interval","Daily"]
["Site Notes","N/A"]
["Site Photos in Dataset","No"]
["Photo Resource Name","N/A"]
["Parameter 1","maxiumum_water_temperature"]
["Unit of Measurement","degrees Celsius"]
["Instrument Type","Data Logger"]
{"$rows_left_out":34}
{"sheet":"2.b Metadata Definitions","index":2,"n_rows":72,"n_cols":6,"rows_kept":72}
["Metadata Definitions"]
[" ","Definition","Format","Example"]
["Site ID","Unique name/code used to identify the monitoring site (assigned by monitoring organization). ","Text","SAH_01"]
["Waterbody Type","The type of waterbody the measurements were taken from","Text","Stream"]
["Waterbody","Name of the waterbody where monitoring took place.","Text ","Slocan Lake"]
["Location/Site Name","Geographically descriptive name of the monitoring site.","Text","Slocan River at Passmore Bridge"]
["Location Latitude","Latitude. Decimal degrees. ","Decimal degrees",51.048614]
["Location Longitude","Longitude. Decimal degrees.","Decimal degrees",-114.070821]
["Location Coordinate System","The datum that your latitude and longitude coordinates are based upon.","Pick From List","WGS84"]
["Elevation","The elevation of your monitoring location (metres above sea level)","Number",800]
["Measurement Interval","The timescale that measurements are being taken, ex. hourly, every 8 hours, weekly, monthly","Text","Hourly "]
["Site Photos in Dataset","Whether site photos will be included as a separate zipfile as part of the dataset this resource contains","Text","Yes"]
["Photo Resource Name","Name of the Resource that will contain photos relevant to this resource/site","Text","Monitoring Station Photos from Some Creek"]
["Parameter","Type of measurement being taken. Must be expressed without spaces or symbols, lower case, use underscores as needed.","Pick From List","Temperature"]
["Unit of Measurement","Unit of measurement for the parameter referred to above. Do not include symbols.","Pick From List","Degrees Celsius "]
{"$rows_left_out":58}
{"sheet":" 3. Changelog","index":3,"n_rows":2,"n_cols":3,"rows_kept":2}
["Date of Modification","Description of Modification","Name of Person Modifying"]
["2022-04-06","Upload to new template, QA/QC","VS"]