{"text_format":"3","workbook":"xlsx","n_sheets":4,"sheets":["1. Lab Results","2. Metadata","2.b Definitions","3. Changelog"],"not_rendered":{"defined_names":1},"read":"whole","date_system":"1900"}

{"sheet":"1. Lab Results","index":0,"n_rows":216,"n_cols":15,"rows_kept":216}
["date_time_sampled","date_analysed","sample_id","site_ID","latitude","longitude","analyte","analyte_speciation","method","unit_of_measurement","value_type","matrix","detection_limit","values","notes"]
["2015-04-27","Not specified","Not specified","NEMCD01",{"$f":"IF(ISBLANK(D2)=TRUE,\" \", IF(D2='2. Metadata'!B$1,'2. Metadata'!B$5, IF(D2='2. Metadata'!C$1,'2. Metadata'!C$5,IF(D2='2. Metadata'!D$1,'2. Metadata'!D$5, IF(D2='2. Metadata'!E$1,'2. Metadata'!E$5,IF( D2='2. Metadata'!F$1,'2. Metadata'!F$5,IF(D2='2. Metadata'!G$1,'2. Metadata'!G$5,IF(D2='2. Metadata'!H$1,'2. Metadata'!H$5, IF(D2='2. Metadata'!I$1,'2. Metadata'!I$5, IF(D2='2. Metadata'!J$1,'2. Metadata'!J$5, IF(D2='2. Metadata'!K$1,'2. Metadata'!K$5, IF(D2='2. Metadata'!L$1,'2. Metadata'!L$5, IF(D2='2. Metadata'!M$1,'2. Metadata'!M$5, IF(D2='2. Metadata'!N$1,'2. Metadata'!N$5))))))))))))))","v":50.145},{"$f":"IF(ISBLANK(D2)=TRUE,\" \", IF(D2='2. Metadata'!B$1,'2. Metadata'!B$6, IF(D2='2. Metadata'!C$1,'2. Metadata'!C$6,IF(D2='2. Metadata'!D$1,'2. Metadata'!D$6, IF(D2='2. Metadata'!E$1,'2. Metadata'!E$6,IF( D2='2. Metadata'!F$1,'2. Metadata'!F$6,IF(D2='2. Metadata'!G$1,'2. Metadata'!G$6,IF(D2='2. Metadata'!H$1,'2. Metadata'!H$6, IF(D2='2. Metadata'!I$1,'2. Metadata'!I$6, IF(D2='2. Metadata'!J$1,'2. Metadata'!J$6, IF(D2='2. Metadata'!K$1,'2. Metadata'!K$6, IF(D2='2. Metadata'!L$1,'2. Metadata'!L$6, IF(D2='2. Metadata'!M$1,'2. Metadata'!M$6, IF(D2='2. Metadata'!N$1,'2. Metadata'!N$6))))))))))))))","v":-117.79389},"Oxygen","Dissolved","In situ","mg/L","actual","water","not specified",7,"N/A"]
["2015-04-27","Not specified","Not specified","NEMCD01",{"$f":"IF(ISBLANK(D3)=TRUE,\" \", IF(D3='2. Metadata'!B$1,'2. Metadata'!B$5, IF(D3='2. Metadata'!C$1,'2. Metadata'!C$5,IF(D3='2. Metadata'!D$1,'2. Metadata'!D$5, IF(D3='2. Metadata'!E$1,'2. Metadata'!E$5,IF( D3='2. Metadata'!F$1,'2. Metadata'!F$5,IF(D3='2. Metadata'!G$1,'2. Metadata'!G$5,IF(D3='2. Metadata'!H$1,'2. Metadata'!H$5, IF(D3='2. Metadata'!I$1,'2. Metadata'!I$5, IF(D3='2. Metadata'!J$1,'2. Metadata'!J$5, IF(D3='2. Metadata'!K$1,'2. Metadata'!K$5, IF(D3='2. Metadata'!L$1,'2. Metadata'!L$5, IF(D3='2. Metadata'!M$1,'2. Metadata'!M$5, IF(D3='2. Metadata'!N$1,'2. Metadata'!N$5))))))))))))))","v":50.145},{"$f":"IF(ISBLANK(D3)=TRUE,\" \", IF(D3='2. Metadata'!B$1,'2. Metadata'!B$6, IF(D3='2. Metadata'!C$1,'2. Metadata'!C$6,IF(D3='2. Metadata'!D$1,'2. Metadata'!D$6, IF(D3='2. Metadata'!E$1,'2. Metadata'!E$6,IF( D3='2. Metadata'!F$1,'2. Metadata'!F$6,IF(D3='2. Metadata'!G$1,'2. Metadata'!G$6,IF(D3='2. Metadata'!H$1,'2. Metadata'!H$6, IF(D3='2. Metadata'!I$1,'2. Metadata'!I$6, IF(D3='2. Metadata'!J$1,'2. Metadata'!J$6, IF(D3='2. Metadata'!K$1,'2. Metadata'!K$6, IF(D3='2. Metadata'!L$1,'2. Metadata'!L$6, IF(D3='2. Metadata'!M$1,'2. Metadata'!M$6, IF(D3='2. Metadata'!N$1,'2. Metadata'!N$6))))))))))))))","v":-117.79389},"Conductivity ","EC","In situ","uS/cm","actual","water",1,158.3,"N/A"]
["2015-04-27","Not specified","Not specified","NEMCD01",{"$f":"IF(ISBLANK(D4)=TRUE,\" \", IF(D4='2. Metadata'!B$1,'2. Metadata'!B$5, IF(D4='2. Metadata'!C$1,'2. Metadata'!C$5,IF(D4='2. Metadata'!D$1,'2. Metadata'!D$5, IF(D4='2. Metadata'!E$1,'2. Metadata'!E$5,IF( D4='2. Metadata'!F$1,'2. Metadata'!F$5,IF(D4='2. Metadata'!G$1,'2. Metadata'!G$5,IF(D4='2. Metadata'!H$1,'2. Metadata'!H$5, IF(D4='2. Metadata'!I$1,'2. Metadata'!I$5, IF(D4='2. Metadata'!J$1,'2. Metadata'!J$5, IF(D4='2. Metadata'!K$1,'2. Metadata'!K$5, IF(D4='2. Metadata'!L$1,'2. Metadata'!L$5, IF(D4='2. Metadata'!M$1,'2. Metadata'!M$5, IF(D4='2. Metadata'!N$1,'2. Metadata'!N$5))))))))))))))","v":50.145},{"$f":"IF(ISBLANK(D4)=TRUE,\" \", IF(D4='2. Metadata'!B$1,'2. Metadata'!B$6, IF(D4='2. Metadata'!C$1,'2. Metadata'!C$6,IF(D4='2. Metadata'!D$1,'2. Metadata'!D$6, IF(D4='2. Metadata'!E$1,'2. Metadata'!E$6,IF( D4='2. Metadata'!F$1,'2. Metadata'!F$6,IF(D4='2. Metadata'!G$1,'2. Metadata'!G$6,IF(D4='2. Metadata'!H$1,'2. Metadata'!H$6, IF(D4='2. Metadata'!I$1,'2. Metadata'!I$6, IF(D4='2. Metadata'!J$1,'2. Metadata'!J$6, IF(D4='2. Metadata'!K$1,'2. Metadata'!K$6, IF(D4='2. Metadata'!L$1,'2. Metadata'!L$6, IF(D4='2. Metadata'!M$1,'2. Metadata'!M$6, IF(D4='2. Metadata'!N$1,'2. Metadata'!N$6))))))))))))))","v":-117.79389},"pH","N/A","In situ","pH units","actual","water","Not specified",7.71,"N/A"]
["2015-04-27","Not specified","Not specified","NEMCD01",{"$f":"IF(ISBLANK(D5)=TRUE,\" \", IF(D5='2. Metadata'!B$1,'2. Metadata'!B$5, IF(D5='2. Metadata'!C$1,'2. Metadata'!C$5,IF(D5='2. Metadata'!D$1,'2. Metadata'!D$5, IF(D5='2. Metadata'!E$1,'2. Metadata'!E$5,IF( D5='2. Metadata'!F$1,'2. Metadata'!F$5,IF(D5='2. Metadata'!G$1,'2. Metadata'!G$5,IF(D5='2. Metadata'!H$1,'2. Metadata'!H$5, IF(D5='2. Metadata'!I$1,'2. Metadata'!I$5, IF(D5='2. Metadata'!J$1,'2. Metadata'!J$5, IF(D5='2. Metadata'!K$1,'2. Metadata'!K$5, IF(D5='2. Metadata'!L$1,'2. Metadata'!L$5, IF(D5='2. Metadata'!M$1,'2. Metadata'!M$5, IF(D5='2. Metadata'!N$1,'2. Metadata'!N$5))))))))))))))","v":50.145},{"$f":"IF(ISBLANK(D5)=TRUE,\" \", IF(D5='2. Metadata'!B$1,'2. Metadata'!B$6, IF(D5='2. Metadata'!C$1,'2. Metadata'!C$6,IF(D5='2. Metadata'!D$1,'2. Metadata'!D$6, IF(D5='2. Metadata'!E$1,'2. Metadata'!E$6,IF( D5='2. Metadata'!F$1,'2. Metadata'!F$6,IF(D5='2. Metadata'!G$1,'2. Metadata'!G$6,IF(D5='2. Metadata'!H$1,'2. Metadata'!H$6, IF(D5='2. Metadata'!I$1,'2. Metadata'!I$6, IF(D5='2. Metadata'!J$1,'2. Metadata'!J$6, IF(D5='2. Metadata'!K$1,'2. Metadata'!K$6, IF(D5='2. Metadata'!L$1,'2. Metadata'!L$6, IF(D5='2. Metadata'!M$1,'2. Metadata'!M$6, IF(D5='2. Metadata'!N$1,'2. Metadata'!N$6))))))))))))))","v":-117.79389},"Turbidity","N/A","In situ","NTU","actual","water","Not specified",0.39,"N/A"]
["2015-04-27","Not specified","Not specified","NEMCD01",{"$f":"IF(ISBLANK(D6)=TRUE,\" \", IF(D6='2. Metadata'!B$1,'2. Metadata'!B$5, IF(D6='2. Metadata'!C$1,'2. Metadata'!C$5,IF(D6='2. Metadata'!D$1,'2. Metadata'!D$5, IF(D6='2. Metadata'!E$1,'2. Metadata'!E$5,IF( D6='2. Metadata'!F$1,'2. Metadata'!F$5,IF(D6='2. Metadata'!G$1,'2. Metadata'!G$5,IF(D6='2. Metadata'!H$1,'2. Metadata'!H$5, IF(D6='2. Metadata'!I$1,'2. Metadata'!I$5, IF(D6='2. Metadata'!J$1,'2. Metadata'!J$5, IF(D6='2. Metadata'!K$1,'2. Metadata'!K$5, IF(D6='2. Metadata'!L$1,'2. Metadata'!L$5, IF(D6='2. Metadata'!M$1,'2. Metadata'!M$5, IF(D6='2. Metadata'!N$1,'2. Metadata'!N$5))))))))))))))","v":50.145},{"$f":"IF(ISBLANK(D6)=TRUE,\" \", IF(D6='2. Metadata'!B$1,'2. Metadata'!B$6, IF(D6='2. Metadata'!C$1,'2. Metadata'!C$6,IF(D6='2. Metadata'!D$1,'2. Metadata'!D$6, IF(D6='2. Metadata'!E$1,'2. Metadata'!E$6,IF( D6='2. Metadata'!F$1,'2. Metadata'!F$6,IF(D6='2. Metadata'!G$1,'2. Metadata'!G$6,IF(D6='2. Metadata'!H$1,'2. Metadata'!H$6, IF(D6='2. Metadata'!I$1,'2. Metadata'!I$6, IF(D6='2. Metadata'!J$1,'2. Metadata'!J$6, IF(D6='2. Metadata'!K$1,'2. Metadata'!K$6, IF(D6='2. Metadata'!L$1,'2. Metadata'!L$6, IF(D6='2. Metadata'!M$1,'2. Metadata'!M$6, IF(D6='2. Metadata'!N$1,'2. Metadata'!N$6))))))))))))))","v":-117.79389},"Temperature","N/A","In situ","Degrees Celsius","actual","water","Not specified",4.5,"N/A"]
["2015-04-27","Not specified","Not specified","NEMCD01",{"$f":"IF(ISBLANK(D7)=TRUE,\" \", IF(D7='2. Metadata'!B$1,'2. Metadata'!B$5, IF(D7='2. Metadata'!C$1,'2. Metadata'!C$5,IF(D7='2. Metadata'!D$1,'2. Metadata'!D$5, IF(D7='2. Metadata'!E$1,'2. Metadata'!E$5,IF( D7='2. Metadata'!F$1,'2. Metadata'!F$5,IF(D7='2. Metadata'!G$1,'2. Metadata'!G$5,IF(D7='2. Metadata'!H$1,'2. Metadata'!H$5, IF(D7='2. Metadata'!I$1,'2. Metadata'!I$5, IF(D7='2. Metadata'!J$1,'2. Metadata'!J$5, IF(D7='2. Metadata'!K$1,'2. Metadata'!K$5, IF(D7='2. Metadata'!L$1,'2. Metadata'!L$5, IF(D7='2. Metadata'!M$1,'2. Metadata'!M$5, IF(D7='2. Metadata'!N$1,'2. Metadata'!N$5))))))))))))))","v":50.145},{"$f":"IF(ISBLANK(D7)=TRUE,\" \", IF(D7='2. Metadata'!B$1,'2. Metadata'!B$6, IF(D7='2. Metadata'!C$1,'2. Metadata'!C$6,IF(D7='2. Metadata'!D$1,'2. Metadata'!D$6, IF(D7='2. Metadata'!E$1,'2. Metadata'!E$6,IF( D7='2. Metadata'!F$1,'2. Metadata'!F$6,IF(D7='2. Metadata'!G$1,'2. Metadata'!G$6,IF(D7='2. Metadata'!H$1,'2. Metadata'!H$6, IF(D7='2. Metadata'!I$1,'2. Metadata'!I$6, IF(D7='2. Metadata'!J$1,'2. Metadata'!J$6, IF(D7='2. Metadata'!K$1,'2. Metadata'!K$6, IF(D7='2. Metadata'!L$1,'2. Metadata'!L$6, IF(D7='2. Metadata'!M$1,'2. Metadata'!M$6, IF(D7='2. Metadata'!N$1,'2. Metadata'!N$6))))))))))))))","v":-117.79389},"Temperature","N/A","In situ","Degrees Celsius","actual","air","Not specified",7.8,"Air temp"]
["2015-04-27","Not specified","Not specified","NEMCD01",{"$f":"IF(ISBLANK(D8)=TRUE,\" \", IF(D8='2. Metadata'!B$1,'2. Metadata'!B$5, IF(D8='2. Metadata'!C$1,'2. Metadata'!C$5,IF(D8='2. Metadata'!D$1,'2. Metadata'!D$5, IF(D8='2. Metadata'!E$1,'2. Metadata'!E$5,IF( D8='2. Metadata'!F$1,'2. Metadata'!F$5,IF(D8='2. Metadata'!G$1,'2. Metadata'!G$5,IF(D8='2. Metadata'!H$1,'2. Metadata'!H$5, IF(D8='2. Metadata'!I$1,'2. Metadata'!I$5, IF(D8='2. Metadata'!J$1,'2. Metadata'!J$5, IF(D8='2. Metadata'!K$1,'2. Metadata'!K$5, IF(D8='2. Metadata'!L$1,'2. Metadata'!L$5, IF(D8='2. Metadata'!M$1,'2. Metadata'!M$5, IF(D8='2. Metadata'!N$1,'2. Metadata'!N$5))))))))))))))","v":50.145},{"$f":"IF(ISBLANK(D8)=TRUE,\" \", IF(D8='2. Metadata'!B$1,'2. Metadata'!B$6, IF(D8='2. Metadata'!C$1,'2. Metadata'!C$6,IF(D8='2. Metadata'!D$1,'2. Metadata'!D$6, IF(D8='2. Metadata'!E$1,'2. Metadata'!E$6,IF( D8='2. Metadata'!F$1,'2. Metadata'!F$6,IF(D8='2. Metadata'!G$1,'2. Metadata'!G$6,IF(D8='2. Metadata'!H$1,'2. Metadata'!H$6, IF(D8='2. Metadata'!I$1,'2. Metadata'!I$6, IF(D8='2. Metadata'!J$1,'2. Metadata'!J$6, IF(D8='2. Metadata'!K$1,'2. Metadata'!K$6, IF(D8='2. Metadata'!L$1,'2. Metadata'!L$6, IF(D8='2. Metadata'!M$1,'2. Metadata'!M$6, IF(D8='2. Metadata'!N$1,'2. Metadata'!N$6))))))))))))))","v":-117.79389},"Solids","Total Suspended","Sample analysed in lab","mg/L","actual","water",4,"<4.0","N/A"]
["2015-05-26","Not specified","Not specified","NEMCD01",{"$f":"IF(ISBLANK(D9)=TRUE,\" \", IF(D9='2. Metadata'!B$1,'2. Metadata'!B$5, IF(D9='2. Metadata'!C$1,'2. Metadata'!C$5,IF(D9='2. Metadata'!D$1,'2. Metadata'!D$5, IF(D9='2. Metadata'!E$1,'2. Metadata'!E$5,IF( D9='2. Metadata'!F$1,'2. Metadata'!F$5,IF(D9='2. Metadata'!G$1,'2. Metadata'!G$5,IF(D9='2. Metadata'!H$1,'2. Metadata'!H$5, IF(D9='2. Metadata'!I$1,'2. Metadata'!I$5, IF(D9='2. Metadata'!J$1,'2. Metadata'!J$5, IF(D9='2. Metadata'!K$1,'2. Metadata'!K$5, IF(D9='2. Metadata'!L$1,'2. Metadata'!L$5, IF(D9='2. Metadata'!M$1,'2. Metadata'!M$5, IF(D9='2. Metadata'!N$1,'2. Metadata'!N$5))))))))))))))","v":50.145},{"$f":"IF(ISBLANK(D9)=TRUE,\" \", IF(D9='2. Metadata'!B$1,'2. Metadata'!B$6, IF(D9='2. Metadata'!C$1,'2. Metadata'!C$6,IF(D9='2. Metadata'!D$1,'2. Metadata'!D$6, IF(D9='2. Metadata'!E$1,'2. Metadata'!E$6,IF( D9='2. Metadata'!F$1,'2. Metadata'!F$6,IF(D9='2. Metadata'!G$1,'2. Metadata'!G$6,IF(D9='2. Metadata'!H$1,'2. Metadata'!H$6, IF(D9='2. Metadata'!I$1,'2. Metadata'!I$6, IF(D9='2. Metadata'!J$1,'2. Metadata'!J$6, IF(D9='2. Metadata'!K$1,'2. Metadata'!K$6, IF(D9='2. Metadata'!L$1,'2. Metadata'!L$6, IF(D9='2. Metadata'!M$1,'2. Metadata'!M$6, IF(D9='2. Metadata'!N$1,'2. Metadata'!N$6))))))))))))))","v":-117.79389},"Phosphate","ortho-, dissolved (as P)","Sample analysed in lab","µg/L","actual","water",0.005,"<5","N/A"]
["2015-05-26","Not specified","Not specified","NEMCD01",{"$f":"IF(ISBLANK(D10)=TRUE,\" \", IF(D10='2. Metadata'!B$1,'2. Metadata'!B$5, IF(D10='2. Metadata'!C$1,'2. Metadata'!C$5,IF(D10='2. Metadata'!D$1,'2. Metadata'!D$5, IF(D10='2. Metadata'!E$1,'2. Metadata'!E$5,IF( D10='2. Metadata'!F$1,'2. Metadata'!F$5,IF(D10='2. Metadata'!G$1,'2. Metadata'!G$5,IF(D10='2. Metadata'!H$1,'2. Metadata'!H$5, IF(D10='2. Metadata'!I$1,'2. Metadata'!I$5, IF(D10='2. Metadata'!J$1,'2. Metadata'!J$5, IF(D10='2. Metadata'!K$1,'2. Metadata'!K$5, IF(D10='2. Metadata'!L$1,'2. Metadata'!L$5, IF(D10='2. Metadata'!M$1,'2. Metadata'!M$5, IF(D10='2. Metadata'!N$1,'2. Metadata'!N$5))))))))))))))","v":50.145},{"$f":"IF(ISBLANK(D10)=TRUE,\" \", IF(D10='2. Metadata'!B$1,'2. Metadata'!B$6, IF(D10='2. Metadata'!C$1,'2. Metadata'!C$6,IF(D10='2. Metadata'!D$1,'2. Metadata'!D$6, IF(D10='2. Metadata'!E$1,'2. Metadata'!E$6,IF( D10='2. Metadata'!F$1,'2. Metadata'!F$6,IF(D10='2. Metadata'!G$1,'2. Metadata'!G$6,IF(D10='2. Metadata'!H$1,'2. Metadata'!H$6, IF(D10='2. Metadata'!I$1,'2. Metadata'!I$6, IF(D10='2. Metadata'!J$1,'2. Metadata'!J$6, IF(D10='2. Metadata'!K$1,'2. Metadata'!K$6, IF(D10='2. Metadata'!L$1,'2. Metadata'!L$6, IF(D10='2. Metadata'!M$1,'2. Metadata'!M$6, IF(D10='2. Metadata'!N$1,'2. Metadata'!N$6))))))))))))))","v":-117.79389},"Oxygen","Dissolved","In situ","mg/L","actual","water","not specified",13,"N/A"]
["2015-05-26","Not specified","Not specified","NEMCD01",{"$f":"IF(ISBLANK(D11)=TRUE,\" \", IF(D11='2. Metadata'!B$1,'2. Metadata'!B$5, IF(D11='2. Metadata'!C$1,'2. Metadata'!C$5,IF(D11='2. Metadata'!D$1,'2. Metadata'!D$5, IF(D11='2. Metadata'!E$1,'2. Metadata'!E$5,IF( D11='2. Metadata'!F$1,'2. Metadata'!F$5,IF(D11='2. Metadata'!G$1,'2. Metadata'!G$5,IF(D11='2. Metadata'!H$1,'2. Metadata'!H$5, IF(D11='2. Metadata'!I$1,'2. Metadata'!I$5, IF(D11='2. Metadata'!J$1,'2. Metadata'!J$5, IF(D11='2. Metadata'!K$1,'2. Metadata'!K$5, IF(D11='2. Metadata'!L$1,'2. Metadata'!L$5, IF(D11='2. Metadata'!M$1,'2. Metadata'!M$5, IF(D11='2. Metadata'!N$1,'2. Metadata'!N$5))))))))))))))","v":50.145},{"$f":"IF(ISBLANK(D11)=TRUE,\" \", IF(D11='2. Metadata'!B$1,'2. Metadata'!B$6, IF(D11='2. Metadata'!C$1,'2. Metadata'!C$6,IF(D11='2. Metadata'!D$1,'2. Metadata'!D$6, IF(D11='2. Metadata'!E$1,'2. Metadata'!E$6,IF( D11='2. Metadata'!F$1,'2. Metadata'!F$6,IF(D11='2. Metadata'!G$1,'2. Metadata'!G$6,IF(D11='2. Metadata'!H$1,'2. Metadata'!H$6, IF(D11='2. Metadata'!I$1,'2. Metadata'!I$6, IF(D11='2. Metadata'!J$1,'2. Metadata'!J$6, IF(D11='2. Metadata'!K$1,'2. Metadata'!K$6, IF(D11='2. Metadata'!L$1,'2. Metadata'!L$6, IF(D11='2. Metadata'!M$1,'2. Metadata'!M$6, IF(D11='2. Metadata'!N$1,'2. Metadata'!N$6))))))))))))))","v":-117.79389},"Conductivity ","EC","In situ","uS/cm","actual","water",1,95.9,"N/A"]
["2015-05-26","Not specified","Not specified","NEMCD01",{"$f":"IF(ISBLANK(D12)=TRUE,\" \", IF(D12='2. Metadata'!B$1,'2. Metadata'!B$5, IF(D12='2. Metadata'!C$1,'2. Metadata'!C$5,IF(D12='2. Metadata'!D$1,'2. Metadata'!D$5, IF(D12='2. Metadata'!E$1,'2. Metadata'!E$5,IF( D12='2. Metadata'!F$1,'2. Metadata'!F$5,IF(D12='2. Metadata'!G$1,'2. Metadata'!G$5,IF(D12='2. Metadata'!H$1,'2. Metadata'!H$5, IF(D12='2. Metadata'!I$1,'2. Metadata'!I$5, IF(D12='2. Metadata'!J$1,'2. Metadata'!J$5, IF(D12='2. Metadata'!K$1,'2. Metadata'!K$5, IF(D12='2. Metadata'!L$1,'2. Metadata'!L$5, IF(D12='2. Metadata'!M$1,'2. Metadata'!M$5, IF(D12='2. Metadata'!N$1,'2. Metadata'!N$5))))))))))))))","v":50.145},{"$f":"IF(ISBLANK(D12)=TRUE,\" \", IF(D12='2. Metadata'!B$1,'2. Metadata'!B$6, IF(D12='2. Metadata'!C$1,'2. Metadata'!C$6,IF(D12='2. Metadata'!D$1,'2. Metadata'!D$6, IF(D12='2. Metadata'!E$1,'2. Metadata'!E$6,IF( D12='2. Metadata'!F$1,'2. Metadata'!F$6,IF(D12='2. Metadata'!G$1,'2. Metadata'!G$6,IF(D12='2. Metadata'!H$1,'2. Metadata'!H$6, IF(D12='2. Metadata'!I$1,'2. Metadata'!I$6, IF(D12='2. Metadata'!J$1,'2. Metadata'!J$6, IF(D12='2. Metadata'!K$1,'2. Metadata'!K$6, IF(D12='2. Metadata'!L$1,'2. Metadata'!L$6, IF(D12='2. Metadata'!M$1,'2. Metadata'!M$6, IF(D12='2. Metadata'!N$1,'2. Metadata'!N$6))))))))))))))","v":-117.79389},"pH","N/A","In situ","pH units","actual","water","Not specified",7.2,"N/A"]
["2015-05-26","Not specified","Not specified","NEMCD01",{"$f":"IF(ISBLANK(D13)=TRUE,\" \", IF(D13='2. Metadata'!B$1,'2. Metadata'!B$5, IF(D13='2. Metadata'!C$1,'2. Metadata'!C$5,IF(D13='2. Metadata'!D$1,'2. Metadata'!D$5, IF(D13='2. Metadata'!E$1,'2. Metadata'!E$5,IF( D13='2. Metadata'!F$1,'2. Metadata'!F$5,IF(D13='2. Metadata'!G$1,'2. Metadata'!G$5,IF(D13='2. Metadata'!H$1,'2. Metadata'!H$5, IF(D13='2. Metadata'!I$1,'2. Metadata'!I$5, IF(D13='2. Metadata'!J$1,'2. Metadata'!J$5, IF(D13='2. Metadata'!K$1,'2. Metadata'!K$5, IF(D13='2. Metadata'!L$1,'2. Metadata'!L$5, IF(D13='2. Metadata'!M$1,'2. Metadata'!M$5, IF(D13='2. Metadata'!N$1,'2. Metadata'!N$5))))))))))))))","v":50.145},{"$f":"IF(ISBLANK(D13)=TRUE,\" \", IF(D13='2. Metadata'!B$1,'2. Metadata'!B$6, IF(D13='2. Metadata'!C$1,'2. Metadata'!C$6,IF(D13='2. Metadata'!D$1,'2. Metadata'!D$6, IF(D13='2. Metadata'!E$1,'2. Metadata'!E$6,IF( D13='2. Metadata'!F$1,'2. Metadata'!F$6,IF(D13='2. Metadata'!G$1,'2. Metadata'!G$6,IF(D13='2. Metadata'!H$1,'2. Metadata'!H$6, IF(D13='2. Metadata'!I$1,'2. Metadata'!I$6, IF(D13='2. Metadata'!J$1,'2. Metadata'!J$6, IF(D13='2. Metadata'!K$1,'2. Metadata'!K$6, IF(D13='2. Metadata'!L$1,'2. Metadata'!L$6, IF(D13='2. Metadata'!M$1,'2. Metadata'!M$6, IF(D13='2. Metadata'!N$1,'2. Metadata'!N$6))))))))))))))","v":-117.79389},"Turbidity","N/A","In situ","NTU","actual","water","Not specified",7.81,"N/A"]
["2015-05-26","Not specified","Not specified","NEMCD01",{"$f":"IF(ISBLANK(D14)=TRUE,\" \", IF(D14='2. Metadata'!B$1,'2. Metadata'!B$5, IF(D14='2. Metadata'!C$1,'2. Metadata'!C$5,IF(D14='2. Metadata'!D$1,'2. Metadata'!D$5, IF(D14='2. Metadata'!E$1,'2. Metadata'!E$5,IF( D14='2. Metadata'!F$1,'2. Metadata'!F$5,IF(D14='2. Metadata'!G$1,'2. Metadata'!G$5,IF(D14='2. Metadata'!H$1,'2. Metadata'!H$5, IF(D14='2. Metadata'!I$1,'2. Metadata'!I$5, IF(D14='2. Metadata'!J$1,'2. Metadata'!J$5, IF(D14='2. Metadata'!K$1,'2. Metadata'!K$5, IF(D14='2. Metadata'!L$1,'2. Metadata'!L$5, IF(D14='2. Metadata'!M$1,'2. Metadata'!M$5, IF(D14='2. Metadata'!N$1,'2. Metadata'!N$5))))))))))))))","v":50.145},{"$f":"IF(ISBLANK(D14)=TRUE,\" \", IF(D14='2. Metadata'!B$1,'2. Metadata'!B$6, IF(D14='2. Metadata'!C$1,'2. Metadata'!C$6,IF(D14='2. Metadata'!D$1,'2. Metadata'!D$6, IF(D14='2. Metadata'!E$1,'2. Metadata'!E$6,IF( D14='2. Metadata'!F$1,'2. Metadata'!F$6,IF(D14='2. Metadata'!G$1,'2. Metadata'!G$6,IF(D14='2. Metadata'!H$1,'2. Metadata'!H$6, IF(D14='2. Metadata'!I$1,'2. Metadata'!I$6, IF(D14='2. Metadata'!J$1,'2. Metadata'!J$6, IF(D14='2. Metadata'!K$1,'2. Metadata'!K$6, IF(D14='2. Metadata'!L$1,'2. Metadata'!L$6, IF(D14='2. Metadata'!M$1,'2. Metadata'!M$6, IF(D14='2. Metadata'!N$1,'2. Metadata'!N$6))))))))))))))","v":-117.79389},"Temperature","N/A","In situ","Degrees Celsius","actual","water","Not specified",6.3,"N/A"]
["2015-05-26","Not specified","Not specified","NEMCD01",{"$f":"IF(ISBLANK(D15)=TRUE,\" \", IF(D15='2. Metadata'!B$1,'2. Metadata'!B$5, IF(D15='2. Metadata'!C$1,'2. Metadata'!C$5,IF(D15='2. Metadata'!D$1,'2. Metadata'!D$5, IF(D15='2. Metadata'!E$1,'2. Metadata'!E$5,IF( D15='2. Metadata'!F$1,'2. Metadata'!F$5,IF(D15='2. Metadata'!G$1,'2. Metadata'!G$5,IF(D15='2. Metadata'!H$1,'2. Metadata'!H$5, IF(D15='2. Metadata'!I$1,'2. Metadata'!I$5, IF(D15='2. Metadata'!J$1,'2. Metadata'!J$5, IF(D15='2. Metadata'!K$1,'2. Metadata'!K$5, IF(D15='2. Metadata'!L$1,'2. Metadata'!L$5, IF(D15='2. Metadata'!M$1,'2. Metadata'!M$5, IF(D15='2. Metadata'!N$1,'2. Metadata'!N$5))))))))))))))","v":50.145},{"$f":"IF(ISBLANK(D15)=TRUE,\" \", IF(D15='2. Metadata'!B$1,'2. Metadata'!B$6, IF(D15='2. Metadata'!C$1,'2. Metadata'!C$6,IF(D15='2. Metadata'!D$1,'2. Metadata'!D$6, IF(D15='2. Metadata'!E$1,'2. Metadata'!E$6,IF( D15='2. Metadata'!F$1,'2. Metadata'!F$6,IF(D15='2. Metadata'!G$1,'2. Metadata'!G$6,IF(D15='2. Metadata'!H$1,'2. Metadata'!H$6, IF(D15='2. Metadata'!I$1,'2. Metadata'!I$6, IF(D15='2. Metadata'!J$1,'2. Metadata'!J$6, IF(D15='2. Metadata'!K$1,'2. Metadata'!K$6, IF(D15='2. Metadata'!L$1,'2. Metadata'!L$6, IF(D15='2. Metadata'!M$1,'2. Metadata'!M$6, IF(D15='2. Metadata'!N$1,'2. Metadata'!N$6))))))))))))))","v":-117.79389},"Temperature","N/A","In situ","Degrees Celsius","actual","air","Not specified",11,"Air temp"]
{"$rows_left_out":202}
{"sheet":"2. Metadata","index":1,"n_rows":20,"n_cols":26,"rows_kept":20}
["Site ID","NEMCD01"]
["Location/Site Name","McDonald Creek (NEMCD01)"]
["Waterbody Type","Streams"]
["Waterbody","McDonald Creek "]
["Site Latitude (decimal degrees)",50.145]
["Site Longitude (decimal degrees)",-117.79389]
["Coordinate System","WGS84"]
["Site Elevation (masl)",470]
["Measurement Interval","Monthly"]
["Site Notes","N/A"]
["Site Photos in Dataset","No"]
["Photo Resource Name","N/A"]
[]
["Sample ID","Not specified",{"$nulls":23},2]
["Site ID ","NEMCD01"]
{"$rows_left_out":6}
{"sheet":"2.b Definitions","index":2,"n_rows":134,"n_cols":5,"rows_kept":134,"merged":[[102,4,105,7]]}
["1. Lab Results Definitions"]
["Field","Definiton","Format","Example"]
["date_time_sampled","When was this sample collected?","YYYY-MM-DD hh:mm:ss","2021-01-20T10:30:00"]
["date_analysed","When was the sample analysed?","(YYYY-MM-DD)","2021-02-17"]
["SiteID","Where was this sample collected?","Text","Slocan_01"]
["SampleID","What is the identification given by the lab to the sample?","Text","AT-2937"]
["Analyte","The chemical parameter being measured","Text","Nitrate"]
["Analyte Specification","In what form is the analyte being analyzed","Text","As N"]
["Method","The method carried out for analyzing for the analyte in question, if provided ","Text","E235.NO3-L"]
["Unit of Measurement","The unit that the analyte in question is being measured in","Text","mg/L"]
["Detection Limit","The lowest result that the method is able to analyze","Number","0.0050"]
["Value Type","This specifies whether a result is actual, blank corrected, calculated, control adjusted, or estimated","Text","calculated"]
["Matrix","The medium used to analyze the sample","Text","Water"]
["Values","Here is where you can paste the actual values/results from the analysis","Number",0.01]
[]
{"$rows_left_out":120}
{"sheet":"3. Changelog","index":3,"n_rows":4,"n_cols":3,"rows_kept":4}
["Date of Modification","Description of Modification","Name of Person Modifying"]
["2021-05-26","Change units for Total Phosphorus from N/A to ug/L","PT"]
["2021-07-07","Update citation and naming convention","PT"]
["2022-04-09","Upload to new template, QA/QC","VS"]